{"text_format":"3","workbook":"xlsx","n_sheets":8,"sheets":["データリスト","役員の割り振り","年度の予定・記録","2ヶ月カレンダー (2)","Sheet1","分会定期大会開催案内書　兼　委任状","分会大会議案書","議長議事進行メモ"],"not_rendered":{"images":2,"macros":1,"defined_names":59},"read":"whole","date_system":"1900"}

{"sheet":"データリスト","index":0,"n_rows":70,"n_cols":40,"rows_kept":70,"merged":[[1,0,1,1],[1,5,1,6],[3,0,3,4],[3,5,3,6],[5,0,5,1],[5,5,5,6],[7,0,8,1],[10,0,12,0],[16,0,16,4],[18,0,18,1],[18,5,18,6],[18,8,18,10],[20,0,20,1],[20,5,20,6],[22,0,23,1],[22,10,22,12],[25,0,25,1],[25,5,25,6],[25,8,25,10],[27,0,27,1],[27,5,27,6],[29,0,29,1],[29,5,29,6],[29,8,29,10],[32,0,32,1],[33,0,33,1],[35,0,35,1],[37,0,37,1],[37,5,37,15],[39,0,42,1],[39,5,39,6],[39,7,39,8],[39,9,39,10],[39,11,39,12],[39,13,39,14],[39,15,39,16],[40,5,42,6],[40,7,42,8],[40,9,42,10],[40,11,42,12],[40,13,42,14],[40,15,42,16],[44,0,65,4],[44,5,44,14],[67,0,67,4],[69,0,69,4]]}
[]
["活動年度",{"$nulls":4},"2021"]
[]
["活動分会名　＆　組合員人数",{"$nulls":4},"福島",null,"＆","37"]
[]
["2021年9月の大会回数",{"$nulls":4},"58",null,{"$f":"F2-2020","v":1},{"$f":"F6+H6","v":59}]
[]
[{"$f":"F2+1&\"年度新役員選挙\"","v":"2022年度新役員選挙"},{"$nulls":4},"告示日","締切日","公示日"]
[{"$nulls":5},"2021-08-06","2021-08-16","2021-08-19",{"$f":"TEXT(F9,\"ｙｙｙｙ年ｍ月ｄ日\")","v":"2021年8月6日"},{"$f":"TEXT(G9,\"ｙｙｙｙ年ｍ月ｄ日\")","v":"2021年8月16日"},{"$f":"TEXT(H9,\"ｙｙｙｙ年ｍ月ｄ日\")","v":"2021年8月19日"}]
[]
["分会役員名簿　　　                                                        　　　　＊10名未満の分会については『委員長・書記長・会計監査』のみ入力",{"$nulls":4},"　　分会執行委員長","　　分会執行副委員長","　　分会書記長","　　分会執行委員","　　分会執行委員","　　分会会計監査員","分会青年部長","共済事務担当者","予備","予備"]
[null,{"$f":"F2+1&\"年度新役員\"","v":"2022年度新役員"},{"$nulls":3},"あ","い","う","え","お","か","き","く"]
[null,{"$f":"F2&\"年度役員\"","v":"2021年度役員"},null,null,"全員","A","B","C","D","E","F","G","H"]
[{"$nulls":5},{"$f":"LEFT(F12,2)","v":"あ"},"い","う","え","お","か","き","く","",""]
[{"$nulls":3},"執行委員","全員",{"$f":"LEFT(F13,2)","v":"A"},{"$f":"LEFT(G13,2)","v":"B"},"C","D","E","F",{"$f":"LEFT(L13,2)","v":"G"},"H","",""]
[]
[{"$f":"F2&\"年度の祝日・休日入力\"","v":"2021年度の祝日・休日入力"},{"$nulls":4},"2021-09-21","2021-09-23","2021-10-11","2021-11-03","2021-11-23","2022-01-01","2022-01-10","2022-02-11","2022-02-23","2022-03-21","2022-04-29","2022-05-03","2022-05-04","2022-05-05","2022-07-18","2022-08-11"]
[]
[{"$f":"F2+1&\"年度の大会日時＆場所\"","v":"2022年度の大会日時＆場所"},{"$nulls":4},"2022-09-06T18:30:00",null,"＆","別館会議室２F"]
[]
["大会の種別（定期・臨時）　　　　　　　　　　　　　　　　　＊本部大会議案書参照",{"$nulls":4},"定期"]
[]
["議事進行メモ作成",{"$nulls":4},"司会者","資格審査","大会成立宣言","大会議長","大会書記","来賓（役職まで入力）その他は「様」",null,null,"分会活動経過報告","会計報告","会計監査報告","活動方針","収支剰余金処理","予算"]
[{"$nulls":5},"花見","冨塚","冨塚","佐藤","元内","神　本部常任執行役員","樋口　本部常任執行役員","猪狩　福島支部委員長","篤志","篤志","柏原","篤志","篤志","篤志"]
[]
[{"$f":"F2&\"年度分会交付金　＆　\"&F2-1&\"年度繰越額\"","v":"2021年度分会交付金　＆　2020年度繰越額"},{"$nulls":4},{"$f":"F33+G33+H33+I33","v":{"v":386600,"d":"¥386,600"}},null,"＆",{"v":13618,"d":"¥13,618"}]
[]
["2021年度受取利息",{"$nulls":4},{"v":1,"d":"¥1"}]
[]
[{"$f":"F2+1&\"年度分会交付金予算金額　&　\"&\"2021年度繰越金額\"","v":"2022年度分会交付金予算金額　&　2021年度繰越金額"},{"$nulls":6},"＆",{"$f":"分会大会議案書!AD50","v":{"v":93013,"d":"¥93,013"}}]
[]
[{"$nulls":5},"総務費","活動調査費","組織活動費","大会費","予備費","割振り可能金額"]
[{"$f":"F2&\"年度予算\"","v":"2021年度予算"},{"$nulls":4},{"v":37400,"d":"¥37,400"},{"v":135000,"d":"¥135,000"},{"v":198100,"d":"¥198,100"},{"v":16100,"d":"¥16,100"},{"$f":"I26","v":{"v":13618,"d":"¥13,618"}},{"$f":"F26+I26-F33-G33-H33-I33-J33","v":{"v":0,"d":"¥0"}},{"$nulls":5},{"$f":"IF(K36=1,L36,IF(K36=2,Q36,IF(K36=3,R36,IF(K36=4,S36,IF(K36=5,T36,\"\")))))","v":""}]
[{"$f":"F2+1&\"年度予算\"","v":"2022年度予算"},{"$nulls":8},{"$f":"I30","v":{"v":93013,"d":"¥93,013"}},{"$f":"F30+I30-F34-G34-I34-H34-J34","v":{"v":0,"d":"¥0"}}]
[]
[{"$f":"F2&\"年度会計監査日\"","v":"2021年度会計監査日"},{"$nulls":9},{"$f":"COUNT(F36:J36)","v":0},{"$f":"TEXT(F36,\"ggge年m月d日\")","v":"明治33年1月0日"},{"$f":"TEXT(G36,\"ggge年m月d日\")","v":"明治33年1月0日"},{"$f":"TEXT(H36,\"ggge年m月d日\")","v":"明治33年1月0日"},{"$f":"TEXT(I36,\"ggge年m月d日\")","v":"明治33年1月0日"},{"$f":"TEXT(J36,\"ggge年m月d日\")","v":"明治33年1月0日"},{"$f":"IF(M36=\"\",L36,L36&\"、\"&M36)","v":"明治33年1月0日、明治33年1月0日"},{"$f":"IF(N36=\"\",Q36,Q36&\"、\"&N36)","v":"明治33年1月0日、明治33年1月0日、明治33年1月0日"},{"$f":"IF(O36=\"\",R36,R36&\"、\"&O36)","v":"明治33年1月0日、明治33年1月0日、明治33年1月0日、明治33年1月0日"},{"$f":"IF(P36=\"\",S36,S36&\"、\"&P36)","v":"明治33年1月0日、明治33年1月0日、明治33年1月0日、明治33年1月0日、明治33年1月0日"}]
[]
["第一号議案活動の基調　　　　　　　　　　　　　　　　　　　　　　＊本部大会資料を基に自分で作ってみよう！！",{"$nulls":4},"がんばるベア！！"]
[]
["第一号議案　　　　　　　　　　　　                                       　　　　　具体的活動について　　　　　　　　　　　                                             　　　　　＊分会の活動を自分で作ってみよう！！",{"$nulls":4},"～生きいきとした存在感ある組織づくりをめざして～",null,"～頼りがいのある生活支援機能の充実をめざして～",null,"～仲間との連携活動の強化をめざして～",null,"～豊かでゆとりあるライフステージの実現をめざして～",null,"～安全で健康な明るい職場の確立をめざして～",null,"～創造的で活力ある職場風土をめざして～"]
[{"$nulls":5},"・生きいきとした存在感ある組織づくりを目指して\n・頼りがいのある生活支援機能の充実を目指して\n・仲間との連携活動の強化を目指して豊かでゆとりあるライフステージの実現を目指して",null,"何としても頑張る",null,"たまに息抜き",null,"そして頑張る",null,"さらに頑張る",null,"神になる"]
[]
[]
[]
["活動内容",{"$nulls":4},"本部・支部活動",{"$nulls":9},"分会活動関係",{"$nulls":5},"会社対応関係",{"$nulls":4},"教育活動関係",{"$nulls":3},"対外活動",null,"保険・生協",{"$nulls":3},"その他"]
[{"$nulls":5},"本部大会","代表代議員会","分会代表者会議","分会三役会議","職場オルグ","分会委員長連絡会議","総合生活改善交渉","支部青年委員会総会","支部・各種委員会・協議会","会社提案・協議申入れ","分会大会","分会執行委員会","分会集会","分会青年部総会","分会青年部幹事会","各種役員選挙","労使協議会","安全衛生委員会","労使パトロール","三六協定","安全推進月間","ユニオンスクール","リーダーカレッジ","ライフプランセミナー","外部団体主催の教育","地協・県総連","政治関連活動","電力生協","電力年金","国民共済","その他共済","その他1","その他2","その他3","その他4"]
[{"$nulls":5},"開催案内・議案周知","開催案内・議案周知","出欠確認・報告","出欠確認・報告","日程調整","出欠確認・報告","開催周知","計画・日程調整","支社・支部労使協議会","申入れ内容の周知","会計監査","計画・周知","計画・日程調整","計画・日程調整","計画・日程調整","選挙管理委員会設置","会社との日程調整","会社との日程調整","会社との日程調整","次年度三六協定説明","《準備月間(6月・11月)》","フレッシュコース(新入社員)","青年リーダー研修","ライフステージコース","ユースリーダーセミナー","参加人数集約・報告","政治研修会","募集周知","職場周知","対外窓口","概要周知"]
[{"$nulls":5},"分会執行委員会（事前確認）","分会執行委員会（事前確認）","会議出席","会議出席","開催周知(会社・職場)","会議出席","職場オルグ準備","開催周知","支社・支部安全衛生委員会協議会","分会集会の開催","周知(職場・会社依頼)","資料作成","周知(職場・会社依頼)","周知(職場・会社依頼)","事前準備(資料作成)","告示","分会執行委員会（日程の確認）","分会執行委員会","パトロール","締結","取組事項の協議","ヤングコース(3年目)","レクリーダー研修","ライフサポートコース","ﾕﾆｵﾝﾘｰﾀﾞｰｽｸｰﾙ","・メーデー","後援会入会・紹介活動","資料・申込書配布","資料・申込書配布","所内窓口","申請書類の確認"]
[{"$nulls":5},"分会集会・意見集約","分会集会・意見集約","確認事項　職場周知","確認事項　職場周知","会場設営","分会執行委員会(内容周知)","オルグの開催","事前準備(資料作成)","WLB支社委員会","意見集約","事前準備(資料作成)","買い出し(必要に応じて)","事前準備(資料作成)","事前準備(資料作成)","《幹事会の開催》","立候補","分会集会（意見収集）","職場意見収集","結果の確認","締結事項報告","取組事項の周知","パワーアップコース(7年目)","分会役員研修",null,"県総連要請　研修会","・中央・各地区決起集会","ポスティング活動","東日本興業との日程調整","不足書類の手配","新規・更新案内","各種申請"]
[{"$nulls":5},"分会執行委員会（意見確認）","分会執行委員会（意見確認）",null,null,"オルグの開催","職場集会（報告・内容周知）","意見集約","議長・進行",null,"報告","事前準備(会場手配・設営・撤収)","執行委員会開催","事前準備(会場設営)","事前準備(会場準備)","議長・司会進行","公示","分会執行委員会（議題の提案）","委員会の開催",null,"職場周知","労使パトロールの日程調整","ステップアップコース(10年目)","分会委員長研修",null,null,"・地協代表者会議・幹事会","事務所開き","職場周知・申込書の配布","申込書回収","資料・申込書配布","金額確認・引出し"]
[{"$nulls":5},"大会出席","大会出席",null,null,"会場片付け",null,"スト権批准投票","確認事項周知",null,null,"事前準備(買い出し)","議事録の作成","事前準備(買い出し)","《総会の開催》","意見集約","投票","分会集会（提起議題決定）","決定・確認事項周知",null,null,"安全点検・衛生対話の日程調整","フォローアップコース(15年目以降の対象者)",{"$nulls":3},"県総連　青年女性委員会","出陣式","会場調整","申込書の記載内容の確認","日程調整","金種分け・袋詰め"]
[{"$nulls":5},"決定・確認事項　職場周知","決定・確認事項　職場周知",{"$nulls":4},"スト権報告","報告（支部・本部へ報告）",null,null,"各種役員依頼","会計確認","《分会集会開催》","議長・司会進行","職場周知",null,"議題会社提起",{"$nulls":3},"《本月間(7月・12月)》",{"$nulls":4},"集約・報告","電話作戦・ウグイス","会場準備","書類の送付","職場周知","保険金控除証明書"]
[{"$nulls":11},"地区交渉推進会議",{"$nulls":3},"会場設営",null,"議長・司会進行","意見集約",null,null,"協議会の開催",{"$nulls":3},"本部委員長メッセージ代読",{"$nulls":4},"県総連　青年女性イベント","点検定着活動","説明会司会",null,"会場調整","慶弔共済金請求"]
[{"$nulls":11},"分会執行委員会(内容周知)",{"$nulls":3},"分会大会開催",null,"意見集約","報告(分会へ)",null,null,"分会集会にて協議事項の周知",{"$nulls":3},"「私たちの取組み」の掲示",{"$nulls":4},"集約・報告","期日前投票のお願い","会場片付け",null,"会場準備"]
[{"$nulls":11},"職場集会(内容周知)",{"$nulls":3},"司会進行",{"$nulls":9},"☆事業所取り組み事項",{"$nulls":5},"遊説打ち上げ","申込書回収",null,"説明会司会"]
[{"$nulls":15},"活動経過報告",{"$nulls":9},"労使パトロール実施",{"$nulls":5},"投票確認・報告","申込書の記載内容の確認",null,"会場片付け"]
[{"$nulls":15},"会計報告",{"$nulls":9},"安全点検・衛生対話実施",{"$nulls":6},"申込書の送付",null,"申込書回収"]
[{"$nulls":15},"会計監査報告",{"$nulls":16},"対外窓口",null,"書類の確認"]
[{"$nulls":15},"議案の上程",{"$nulls":16},"所内窓口",null,"書類の提出"]
[{"$nulls":32},"書類の管理・手配"]
[{"$nulls":32},"提出書類の確認"]
[{"$nulls":32},"書類の送付"]
[]
[]
[]
[]
[]
["カレンダー",{"$nulls":4},{"$f":"F2","v":"2021"},"年度","8","月",{"$f":"DATE(F68,H68,1)","v":"2021-08-01"},{"$f":"WEEKDAY(J68)","v":1}]
[]
["出費・収入項目",{"$nulls":4},"総務費","活動調査費","組織活動費","大会費","予備費","分会交付金","申請金額"]

{"sheet":"役員の割り振り","index":1,"n_rows":734,"n_cols":26,"rows_kept":734,"merged":[[5,1,6,7],[5,8,6,13]]}
[]
[{"$nulls":3},"業務比率"]
[{"$nulls":3},{"$f":"IF(データリスト!F13=\"\",\"\",データリスト!F15)","v":"A"},{"$f":"IF(データリスト!G13=\"\",\"\",データリスト!G15)","v":"B"},{"$f":"IF(データリスト!H13=\"\",\"\",データリスト!H15)","v":"C"},{"$f":"IF(データリスト!I13=\"\",\"\",データリスト!I15)","v":"D"},{"$f":"IF(データリスト!J13=\"\",\"\",データリスト!J15)","v":"E"},{"$f":"IF(データリスト!K13=\"\",\"\",データリスト!K15)","v":"F"},{"$f":"IF(データリスト!L13=\"\",\"\",データリスト!L15)","v":"G"},{"$f":"IF(データリスト!M13=\"\",\"\",データリスト!M15)","v":"H"},{"$f":"IF(データリスト!N13=\"\",\"\",データリスト!N15)","v":""},{"$f":"IF(データリスト!O13=\"\",\"\",データリスト!O15)","v":""}]
[{"$nulls":3},{"$f":"T8","v":{"v":0,"d":"0.0%"}},{"$f":"T9","v":{"v":0,"d":"0.0%"}},{"$f":"T10","v":{"v":0,"d":"0.0%"}},{"$f":"T11","v":{"v":0,"d":"0.0%"}},{"$f":"T12","v":{"v":0,"d":"0.0%"}},{"$f":"T13","v":{"v":0,"d":"0.0%"}},{"$f":"T14","v":{"v":0,"d":"0.0%"}},{"$f":"T15","v":{"v":0,"d":"0.0%"}},{"$f":"T16","v":{"v":0,"d":"0.0%"}},{"$f":"T17","v":{"v":0,"d":"0.0%"}}]
[]
[null,"活動内容",{"$nulls":6},"担当者選択",{"$nulls":8},{"$f":"700-COUNTIF(C9:C708,\"\")","v":200}]
[]
[{"$nulls":8},"メイン","サブ１","サブ２","サブ３","サブ４","サブ５",{"$nulls":3},{"$f":"IF(データリスト!F15=\"\",0,COUNTIF($I$9:$N$708,データリスト!F15))","v":0},{"$f":"データリスト!F15","v":"A"},{"$f":"R8/R6","v":{"v":0,"d":"0.000%"}}]
[null,{"$f":"データリスト!F$46","v":"本部大会"},{"$f":"IF(データリスト!$F47=\"\",\"\",データリスト!$F47)","v":"開催案内・議案周知"},{"$nulls":14},{"$f":"IF(データリスト!G15=\"\",0,COUNTIF($I$9:$N$708,データリスト!G15))","v":0},{"$f":"データリスト!G15","v":"B"},{"$f":"R9/R6","v":{"v":0,"d":"0.000%"}},{"$f":"IF(I9:N9=\"\",\"\",IF(J9:N9=\"\",I9,IF(K9:N9=\"\",I9&\"・\"&J9,IF(L9:N9=\"\",I9&\"・\"&J9&\"・\"&K9,IF(M9:N9=\"\",I9&\"・\"&J9&\"・\"&K9&\"・\"&L9,IF(N9=\"\",I9&\"・\"&J9&\"・\"&K9&\"・\"&L9&\"・\"&M9,I9&\"・\"&J9&\"・\"&K9&\"・\"&L9&\"・\"&M9&\"・\"&N9))))))","v":""},"","","","",""]
[null,{"$f":"データリスト!F$46","v":"本部大会"},{"$f":"IF(データリスト!$F48=\"\",\"\",データリスト!$F48)","v":"分会執行委員会（事前確認）"},{"$nulls":14},{"$f":"IF(データリスト!H15=\"\",0,COUNTIF($I$9:$N$708,データリスト!H15))","v":0},{"$f":"データリスト!H15","v":"C"},{"$f":"R10/R6","v":{"v":0,"d":"0.000%"}},{"$f":"IF(I10:N10=\"\",\"\",IF(J10:N10=\"\",I10,IF(K10:N10=\"\",I10&\"・\"&J10,IF(L10:N10=\"\",I10&\"・\"&J10&\"・\"&K10,IF(M10:N10=\"\",I10&\"・\"&J10&\"・\"&K10&\"・\"&L10,IF(N10=\"\",I10&\"・\"&J10&\"・\"&K10&\"・\"&L10&\"・\"&M10,I10&\"・\"&J10&\"・\"&K10&\"・\"&L10&\"・\"&M10&\"・\"&N10))))))","v":""},"","","","",""]
[null,{"$f":"データリスト!F$46","v":"本部大会"},{"$f":"IF(データリスト!$F49=\"\",\"\",データリスト!$F49)","v":"分会集会・意見集約"},{"$nulls":14},{"$f":"IF(データリスト!I15=\"\",0,COUNTIF($I$9:$N$708,データリスト!I15))","v":0},{"$f":"データリスト!I15","v":"D"},{"$f":"R11/R6","v":{"v":0,"d":"0.000%"}},{"$f":"IF(I11:N11=\"\",\"\",IF(J11:N11=\"\",I11,IF(K11:N11=\"\",I11&\"・\"&J11,IF(L11:N11=\"\",I11&\"・\"&J11&\"・\"&K11,IF(M11:N11=\"\",I11&\"・\"&J11&\"・\"&K11&\"・\"&L11,IF(N11=\"\",I11&\"・\"&J11&\"・\"&K11&\"・\"&L11&\"・\"&M11,I11&\"・\"&J11&\"・\"&K11&\"・\"&L11&\"・\"&M11&\"・\"&N11))))))","v":""},"","","","",""]
[null,{"$f":"データリスト!F$46","v":"本部大会"},{"$f":"IF(データリスト!$F50=\"\",\"\",データリスト!$F50)","v":"分会執行委員会（意見確認）"},{"$nulls":14},{"$f":"IF(データリスト!J15=\"\",0,COUNTIF($I$9:$N$708,データリスト!J15))","v":0},{"$f":"データリスト!J15","v":"E"},{"$f":"R12/R6","v":{"v":0,"d":"0.000%"}},{"$f":"IF(I12:N12=\"\",\"\",IF(J12:N12=\"\",I12,IF(K12:N12=\"\",I12&\"・\"&J12,IF(L12:N12=\"\",I12&\"・\"&J12&\"・\"&K12,IF(M12:N12=\"\",I12&\"・\"&J12&\"・\"&K12&\"・\"&L12,IF(N12=\"\",I12&\"・\"&J12&\"・\"&K12&\"・\"&L12&\"・\"&M12,I12&\"・\"&J12&\"・\"&K12&\"・\"&L12&\"・\"&M12&\"・\"&N12))))))","v":""},"","","","",""]
[null,{"$f":"データリスト!F$46","v":"本部大会"},{"$f":"IF(データリスト!$F51=\"\",\"\",データリスト!$F51)","v":"大会出席"},{"$nulls":14},{"$f":"IF(データリスト!K15=\"\",0,COUNTIF($I$9:$N$708,データリスト!K15))","v":0},{"$f":"データリスト!K15","v":"F"},{"$f":"R13/R6","v":{"v":0,"d":"0.000%"}},{"$f":"IF(I13:N13=\"\",\"\",IF(J13:N13=\"\",I13,IF(K13:N13=\"\",I13&\"・\"&J13,IF(L13:N13=\"\",I13&\"・\"&J13&\"・\"&K13,IF(M13:N13=\"\",I13&\"・\"&J13&\"・\"&K13&\"・\"&L13,IF(N13=\"\",I13&\"・\"&J13&\"・\"&K13&\"・\"&L13&\"・\"&M13,I13&\"・\"&J13&\"・\"&K13&\"・\"&L13&\"・\"&M13&\"・\"&N13))))))","v":""},"","","","",""]
[null,{"$f":"データリスト!F$46","v":"本部大会"},{"$f":"IF(データリスト!$F52=\"\",\"\",データリスト!$F52)","v":"決定・確認事項　職場周知"},{"$nulls":14},{"$f":"IF(データリスト!L15=\"\",0,COUNTIF($I$9:$N$708,データリスト!L15))","v":0},{"$f":"データリスト!L15","v":"G"},{"$f":"R14/R6","v":{"v":0,"d":"0.000%"}},{"$f":"IF(I14:N14=\"\",\"\",IF(J14:N14=\"\",I14,IF(K14:N14=\"\",I14&\"・\"&J14,IF(L14:N14=\"\",I14&\"・\"&J14&\"・\"&K14,IF(M14:N14=\"\",I14&\"・\"&J14&\"・\"&K14&\"・\"&L14,IF(N14=\"\",I14&\"・\"&J14&\"・\"&K14&\"・\"&L14&\"・\"&M14,I14&\"・\"&J14&\"・\"&K14&\"・\"&L14&\"・\"&M14&\"・\"&N14))))))","v":""},"","","","",""]
[null,{"$f":"データリスト!F$46","v":"本部大会"},{"$f":"IF(データリスト!$F53=\"\",\"\",データリスト!$F53)","v":""},{"$nulls":14},{"$f":"IF(データリスト!M15=\"\",0,COUNTIF($I$9:$N$708,データリスト!M15))","v":0},{"$f":"データリスト!M15","v":"H"},{"$f":"R15/R6","v":{"v":0,"d":"0.000%"}},{"$f":"IF(I15:N15=\"\",\"\",IF(J15:N15=\"\",I15,IF(K15:N15=\"\",I15&\"・\"&J15,IF(L15:N15=\"\",I15&\"・\"&J15&\"・\"&K15,IF(M15:N15=\"\",I15&\"・\"&J15&\"・\"&K15&\"・\"&L15,IF(N15=\"\",I15&\"・\"&J15&\"・\"&K15&\"・\"&L15&\"・\"&M15,I15&\"・\"&J15&\"・\"&K15&\"・\"&L15&\"・\"&M15&\"・\"&N15))))))","v":""},"","","","",""]
[null,{"$f":"データリスト!F$46","v":"本部大会"},{"$f":"IF(データリスト!$F54=\"\",\"\",データリスト!$F54)","v":""},{"$nulls":14},{"$f":"IF(データリスト!N15=\"\",0,COUNTIF($I$9:$N$708,データリスト!N15))","v":0},{"$f":"データリスト!N15","v":""},{"$f":"R16/R6","v":{"v":0,"d":"0.000%"}},{"$f":"IF(I16:N16=\"\",\"\",IF(J16:N16=\"\",I16,IF(K16:N16=\"\",I16&\"・\"&J16,IF(L16:N16=\"\",I16&\"・\"&J16&\"・\"&K16,IF(M16:N16=\"\",I16&\"・\"&J16&\"・\"&K16&\"・\"&L16,IF(N16=\"\",I16&\"・\"&J16&\"・\"&K16&\"・\"&L16&\"・\"&M16,I16&\"・\"&J16&\"・\"&K16&\"・\"&L16&\"・\"&M16&\"・\"&N16))))))","v":""},"","","","",""]
[null,{"$f":"データリスト!F$46","v":"本部大会"},{"$f":"IF(データリスト!$F55=\"\",\"\",データリスト!$F55)","v":""},{"$nulls":14},{"$f":"IF(データリスト!O15=\"\",0,COUNTIF($I$9:$N$708,データリスト!O15))","v":0},{"$f":"データリスト!O15","v":""},{"$f":"R17/R6","v":{"v":0,"d":"0.000%"}},{"$f":"IF(I17:N17=\"\",\"\",IF(J17:N17=\"\",I17,IF(K17:N17=\"\",I17&\"・\"&J17,IF(L17:N17=\"\",I17&\"・\"&J17&\"・\"&K17,IF(M17:N17=\"\",I17&\"・\"&J17&\"・\"&K17&\"・\"&L17,IF(N17=\"\",I17&\"・\"&J17&\"・\"&K17&\"・\"&L17&\"・\"&M17,I17&\"・\"&J17&\"・\"&K17&\"・\"&L17&\"・\"&M17&\"・\"&N17))))))","v":""},"","","","",""]
[null,{"$f":"データリスト!F$46","v":"本部大会"},{"$f":"IF(データリスト!$F56=\"\",\"\",データリスト!$F56)","v":""},{"$nulls":17},{"$f":"IF(I18:N18=\"\",\"\",IF(J18:N18=\"\",I18,IF(K18:N18=\"\",I18&\"・\"&J18,IF(L18:N18=\"\",I18&\"・\"&J18&\"・\"&K18,IF(M18:N18=\"\",I18&\"・\"&J18&\"・\"&K18&\"・\"&L18,IF(N18=\"\",I18&\"・\"&J18&\"・\"&K18&\"・\"&L18&\"・\"&M18,I18&\"・\"&J18&\"・\"&K18&\"・\"&L18&\"・\"&M18&\"・\"&N18))))))","v":""},"","","","",""]
[null,{"$f":"データリスト!F$46","v":"本部大会"},{"$f":"IF(データリスト!$F57=\"\",\"\",データリスト!$F57)","v":""},{"$nulls":17},{"$f":"IF(I19:N19=\"\",\"\",IF(J19:N19=\"\",I19,IF(K19:N19=\"\",I19&\"・\"&J19,IF(L19:N19=\"\",I19&\"・\"&J19&\"・\"&K19,IF(M19:N19=\"\",I19&\"・\"&J19&\"・\"&K19&\"・\"&L19,IF(N19=\"\",I19&\"・\"&J19&\"・\"&K19&\"・\"&L19&\"・\"&M19,I19&\"・\"&J19&\"・\"&K19&\"・\"&L19&\"・\"&M19&\"・\"&N19))))))","v":""},"","","","",""]
[null,{"$f":"データリスト!F$46","v":"本部大会"},{"$f":"IF(データリスト!$F58=\"\",\"\",データリスト!$F58)","v":""},{"$nulls":17},{"$f":"IF(I20:N20=\"\",\"\",IF(J20:N20=\"\",I20,IF(K20:N20=\"\",I20&\"・\"&J20,IF(L20:N20=\"\",I20&\"・\"&J20&\"・\"&K20,IF(M20:N20=\"\",I20&\"・\"&J20&\"・\"&K20&\"・\"&L20,IF(N20=\"\",I20&\"・\"&J20&\"・\"&K20&\"・\"&L20&\"・\"&M20,I20&\"・\"&J20&\"・\"&K20&\"・\"&L20&\"・\"&M20&\"・\"&N20))))))","v":""},"","","","",""]
[null,{"$f":"データリスト!F$46","v":"本部大会"},{"$f":"IF(データリスト!$F59=\"\",\"\",データリスト!$F59)","v":""},{"$nulls":17},{"$f":"IF(I21:N21=\"\",\"\",IF(J21:N21=\"\",I21,IF(K21:N21=\"\",I21&\"・\"&J21,IF(L21:N21=\"\",I21&\"・\"&J21&\"・\"&K21,IF(M21:N21=\"\",I21&\"・\"&J21&\"・\"&K21&\"・\"&L21,IF(N21=\"\",I21&\"・\"&J21&\"・\"&K21&\"・\"&L21&\"・\"&M21,I21&\"・\"&J21&\"・\"&K21&\"・\"&L21&\"・\"&M21&\"・\"&N21))))))","v":""},"","","","",""]
[null,{"$f":"データリスト!F$46","v":"本部大会"},{"$f":"IF(データリスト!$F60=\"\",\"\",データリスト!$F60)","v":""},{"$nulls":17},{"$f":"IF(I22:N22=\"\",\"\",IF(J22:N22=\"\",I22,IF(K22:N22=\"\",I22&\"・\"&J22,IF(L22:N22=\"\",I22&\"・\"&J22&\"・\"&K22,IF(M22:N22=\"\",I22&\"・\"&J22&\"・\"&K22&\"・\"&L22,IF(N22=\"\",I22&\"・\"&J22&\"・\"&K22&\"・\"&L22&\"・\"&M22,I22&\"・\"&J22&\"・\"&K22&\"・\"&L22&\"・\"&M22&\"・\"&N22))))))","v":""},"","","","",""]
[null,{"$f":"データリスト!F$46","v":"本部大会"},{"$f":"IF(データリスト!$F61=\"\",\"\",データリスト!$F61)","v":""},{"$nulls":17},{"$f":"IF(I23:N23=\"\",\"\",IF(J23:N23=\"\",I23,IF(K23:N23=\"\",I23&\"・\"&J23,IF(L23:N23=\"\",I23&\"・\"&J23&\"・\"&K23,IF(M23:N23=\"\",I23&\"・\"&J23&\"・\"&K23&\"・\"&L23,IF(N23=\"\",I23&\"・\"&J23&\"・\"&K23&\"・\"&L23&\"・\"&M23,I23&\"・\"&J23&\"・\"&K23&\"・\"&L23&\"・\"&M23&\"・\"&N23))))))","v":""},"","","","",""]
[null,{"$f":"データリスト!F$46","v":"本部大会"},{"$f":"IF(データリスト!$F62=\"\",\"\",データリスト!$F62)","v":""},{"$nulls":17},{"$f":"IF(I24:N24=\"\",\"\",IF(J24:N24=\"\",I24,IF(K24:N24=\"\",I24&\"・\"&J24,IF(L24:N24=\"\",I24&\"・\"&J24&\"・\"&K24,IF(M24:N24=\"\",I24&\"・\"&J24&\"・\"&K24&\"・\"&L24,IF(N24=\"\",I24&\"・\"&J24&\"・\"&K24&\"・\"&L24&\"・\"&M24,I24&\"・\"&J24&\"・\"&K24&\"・\"&L24&\"・\"&M24&\"・\"&N24))))))","v":""},"","","","",""]
[null,{"$f":"データリスト!F$46","v":"本部大会"},{"$f":"IF(データリスト!$F63=\"\",\"\",データリスト!$F63)","v":""},{"$nulls":17},{"$f":"IF(I25:N25=\"\",\"\",IF(J25:N25=\"\",I25,IF(K25:N25=\"\",I25&\"・\"&J25,IF(L25:N25=\"\",I25&\"・\"&J25&\"・\"&K25,IF(M25:N25=\"\",I25&\"・\"&J25&\"・\"&K25&\"・\"&L25,IF(N25=\"\",I25&\"・\"&J25&\"・\"&K25&\"・\"&L25&\"・\"&M25,I25&\"・\"&J25&\"・\"&K25&\"・\"&L25&\"・\"&M25&\"・\"&N25))))))","v":""},"","","","",""]
[null,{"$f":"データリスト!F$46","v":"本部大会"},{"$f":"IF(データリスト!$F64=\"\",\"\",データリスト!$F64)","v":""},{"$nulls":17},{"$f":"IF(I26:N26=\"\",\"\",IF(J26:N26=\"\",I26,IF(K26:N26=\"\",I26&\"・\"&J26,IF(L26:N26=\"\",I26&\"・\"&J26&\"・\"&K26,IF(M26:N26=\"\",I26&\"・\"&J26&\"・\"&K26&\"・\"&L26,IF(N26=\"\",I26&\"・\"&J26&\"・\"&K26&\"・\"&L26&\"・\"&M26,I26&\"・\"&J26&\"・\"&K26&\"・\"&L26&\"・\"&M26&\"・\"&N26))))))","v":""},"","","","",""]
[null,{"$f":"データリスト!F$46","v":"本部大会"},{"$f":"IF(データリスト!$F65=\"\",\"\",データリスト!$F65)","v":""},{"$nulls":17},{"$f":"IF(I27:N27=\"\",\"\",IF(J27:N27=\"\",I27,IF(K27:N27=\"\",I27&\"・\"&J27,IF(L27:N27=\"\",I27&\"・\"&J27&\"・\"&K27,IF(M27:N27=\"\",I27&\"・\"&J27&\"・\"&K27&\"・\"&L27,IF(N27=\"\",I27&\"・\"&J27&\"・\"&K27&\"・\"&L27&\"・\"&M27,I27&\"・\"&J27&\"・\"&K27&\"・\"&L27&\"・\"&M27&\"・\"&N27))))))","v":""},"","","","",""]
[null,{"$f":"データリスト!F$46","v":"本部大会"},{"$f":"IF(データリスト!$F66=\"\",\"\",データリスト!$F66)","v":""},{"$nulls":17},{"$f":"IF(I28:N28=\"\",\"\",IF(J28:N28=\"\",I28,IF(K28:N28=\"\",I28&\"・\"&J28,IF(L28:N28=\"\",I28&\"・\"&J28&\"・\"&K28,IF(M28:N28=\"\",I28&\"・\"&J28&\"・\"&K28&\"・\"&L28,IF(N28=\"\",I28&\"・\"&J28&\"・\"&K28&\"・\"&L28&\"・\"&M28,I28&\"・\"&J28&\"・\"&K28&\"・\"&L28&\"・\"&M28&\"・\"&N28))))))","v":""},"","","","",""]
[null,{"$f":"データリスト!G$46","v":"代表代議員会"},{"$f":"IF(データリスト!$G47=\"\",\"\",データリスト!$G47)","v":"開催案内・議案周知"},{"$nulls":17},{"$f":"IF(I29:N29=\"\",\"\",IF(J29:N29=\"\",I29,IF(K29:N29=\"\",I29&\"・\"&J29,IF(L29:N29=\"\",I29&\"・\"&J29&\"・\"&K29,IF(M29:N29=\"\",I29&\"・\"&J29&\"・\"&K29&\"・\"&L29,IF(N29=\"\",I29&\"・\"&J29&\"・\"&K29&\"・\"&L29&\"・\"&M29,I29&\"・\"&J29&\"・\"&K29&\"・\"&L29&\"・\"&M29&\"・\"&N29))))))","v":""},"","","","",""]
[null,{"$f":"データリスト!G$46","v":"代表代議員会"},{"$f":"IF(データリスト!$G48=\"\",\"\",データリスト!$G48)","v":"分会執行委員会（事前確認）"},{"$nulls":17},{"$f":"IF(I30:N30=\"\",\"\",IF(J30:N30=\"\",I30,IF(K30:N30=\"\",I30&\"・\"&J30,IF(L30:N30=\"\",I30&\"・\"&J30&\"・\"&K30,IF(M30:N30=\"\",I30&\"・\"&J30&\"・\"&K30&\"・\"&L30,IF(N30=\"\",I30&\"・\"&J30&\"・\"&K30&\"・\"&L30&\"・\"&M30,I30&\"・\"&J30&\"・\"&K30&\"・\"&L30&\"・\"&M30&\"・\"&N30))))))","v":""},"","","","",""]
[null,{"$f":"データリスト!G$46","v":"代表代議員会"},{"$f":"IF(データリスト!$G49=\"\",\"\",データリスト!$G49)","v":"分会集会・意見集約"},{"$nulls":17},{"$f":"IF(I31:N31=\"\",\"\",IF(J31:N31=\"\",I31,IF(K31:N31=\"\",I31&\"・\"&J31,IF(L31:N31=\"\",I31&\"・\"&J31&\"・\"&K31,IF(M31:N31=\"\",I31&\"・\"&J31&\"・\"&K31&\"・\"&L31,IF(N31=\"\",I31&\"・\"&J31&\"・\"&K31&\"・\"&L31&\"・\"&M31,I31&\"・\"&J31&\"・\"&K31&\"・\"&L31&\"・\"&M31&\"・\"&N31))))))","v":""},"","","","",""]
[null,{"$f":"データリスト!G$46","v":"代表代議員会"},{"$f":"IF(データリスト!$G50=\"\",\"\",データリスト!$G50)","v":"分会執行委員会（意見確認）"},{"$nulls":17},{"$f":"IF(I32:N32=\"\",\"\",IF(J32:N32=\"\",I32,IF(K32:N32=\"\",I32&\"・\"&J32,IF(L32:N32=\"\",I32&\"・\"&J32&\"・\"&K32,IF(M32:N32=\"\",I32&\"・\"&J32&\"・\"&K32&\"・\"&L32,IF(N32=\"\",I32&\"・\"&J32&\"・\"&K32&\"・\"&L32&\"・\"&M32,I32&\"・\"&J32&\"・\"&K32&\"・\"&L32&\"・\"&M32&\"・\"&N32))))))","v":""},"","","","",""]
[null,{"$f":"データリスト!G$46","v":"代表代議員会"},{"$f":"IF(データリスト!$G51=\"\",\"\",データリスト!$G51)","v":"大会出席"},{"$nulls":17},{"$f":"IF(I33:N33=\"\",\"\",IF(J33:N33=\"\",I33,IF(K33:N33=\"\",I33&\"・\"&J33,IF(L33:N33=\"\",I33&\"・\"&J33&\"・\"&K33,IF(M33:N33=\"\",I33&\"・\"&J33&\"・\"&K33&\"・\"&L33,IF(N33=\"\",I33&\"・\"&J33&\"・\"&K33&\"・\"&L33&\"・\"&M33,I33&\"・\"&J33&\"・\"&K33&\"・\"&L33&\"・\"&M33&\"・\"&N33))))))","v":""},"","","","",""]
[null,{"$f":"データリスト!G$46","v":"代表代議員会"},{"$f":"IF(データリスト!$G52=\"\",\"\",データリスト!$G52)","v":"決定・確認事項　職場周知"},{"$nulls":17},{"$f":"IF(I34:N34=\"\",\"\",IF(J34:N34=\"\",I34,IF(K34:N34=\"\",I34&\"・\"&J34,IF(L34:N34=\"\",I34&\"・\"&J34&\"・\"&K34,IF(M34:N34=\"\",I34&\"・\"&J34&\"・\"&K34&\"・\"&L34,IF(N34=\"\",I34&\"・\"&J34&\"・\"&K34&\"・\"&L34&\"・\"&M34,I34&\"・\"&J34&\"・\"&K34&\"・\"&L34&\"・\"&M34&\"・\"&N34))))))","v":""},"","","","",""]
[null,{"$f":"データリスト!G$46","v":"代表代議員会"},{"$f":"IF(データリスト!$G53=\"\",\"\",データリスト!$G53)","v":""},{"$nulls":17},{"$f":"IF(I35:N35=\"\",\"\",IF(J35:N35=\"\",I35,IF(K35:N35=\"\",I35&\"・\"&J35,IF(L35:N35=\"\",I35&\"・\"&J35&\"・\"&K35,IF(M35:N35=\"\",I35&\"・\"&J35&\"・\"&K35&\"・\"&L35,IF(N35=\"\",I35&\"・\"&J35&\"・\"&K35&\"・\"&L35&\"・\"&M35,I35&\"・\"&J35&\"・\"&K35&\"・\"&L35&\"・\"&M35&\"・\"&N35))))))","v":""},"","","","",""]
[null,{"$f":"データリスト!G$46","v":"代表代議員会"},{"$f":"IF(データリスト!$G54=\"\",\"\",データリスト!$G54)","v":""},{"$nulls":17},{"$f":"IF(I36:N36=\"\",\"\",IF(J36:N36=\"\",I36,IF(K36:N36=\"\",I36&\"・\"&J36,IF(L36:N36=\"\",I36&\"・\"&J36&\"・\"&K36,IF(M36:N36=\"\",I36&\"・\"&J36&\"・\"&K36&\"・\"&L36,IF(N36=\"\",I36&\"・\"&J36&\"・\"&K36&\"・\"&L36&\"・\"&M36,I36&\"・\"&J36&\"・\"&K36&\"・\"&L36&\"・\"&M36&\"・\"&N36))))))","v":""},"","","","",""]
[null,{"$f":"データリスト!G$46","v":"代表代議員会"},{"$f":"IF(データリスト!$G55=\"\",\"\",データリスト!$G55)","v":""},{"$nulls":17},{"$f":"IF(I37:N37=\"\",\"\",IF(J37:N37=\"\",I37,IF(K37:N37=\"\",I37&\"・\"&J37,IF(L37:N37=\"\",I37&\"・\"&J37&\"・\"&K37,IF(M37:N37=\"\",I37&\"・\"&J37&\"・\"&K37&\"・\"&L37,IF(N37=\"\",I37&\"・\"&J37&\"・\"&K37&\"・\"&L37&\"・\"&M37,I37&\"・\"&J37&\"・\"&K37&\"・\"&L37&\"・\"&M37&\"・\"&N37))))))","v":""},"","","","",""]
[null,{"$f":"データリスト!G$46","v":"代表代議員会"},{"$f":"IF(データリスト!$G56=\"\",\"\",データリスト!$G56)","v":""},{"$nulls":17},{"$f":"IF(I38:N38=\"\",\"\",IF(J38:N38=\"\",I38,IF(K38:N38=\"\",I38&\"・\"&J38,IF(L38:N38=\"\",I38&\"・\"&J38&\"・\"&K38,IF(M38:N38=\"\",I38&\"・\"&J38&\"・\"&K38&\"・\"&L38,IF(N38=\"\",I38&\"・\"&J38&\"・\"&K38&\"・\"&L38&\"・\"&M38,I38&\"・\"&J38&\"・\"&K38&\"・\"&L38&\"・\"&M38&\"・\"&N38))))))","v":""},"","","","",""]
[null,{"$f":"データリスト!G$46","v":"代表代議員会"},{"$f":"IF(データリスト!$G57=\"\",\"\",データリスト!$G57)","v":""},{"$nulls":17},{"$f":"IF(I39:N39=\"\",\"\",IF(J39:N39=\"\",I39,IF(K39:N39=\"\",I39&\"・\"&J39,IF(L39:N39=\"\",I39&\"・\"&J39&\"・\"&K39,IF(M39:N39=\"\",I39&\"・\"&J39&\"・\"&K39&\"・\"&L39,IF(N39=\"\",I39&\"・\"&J39&\"・\"&K39&\"・\"&L39&\"・\"&M39,I39&\"・\"&J39&\"・\"&K39&\"・\"&L39&\"・\"&M39&\"・\"&N39))))))","v":""},"","","","",""]
[null,{"$f":"データリスト!G$46","v":"代表代議員会"},{"$f":"IF(データリスト!$G58=\"\",\"\",データリスト!$G58)","v":""},{"$nulls":17},{"$f":"IF(I40:N40=\"\",\"\",IF(J40:N40=\"\",I40,IF(K40:N40=\"\",I40&\"・\"&J40,IF(L40:N40=\"\",I40&\"・\"&J40&\"・\"&K40,IF(M40:N40=\"\",I40&\"・\"&J40&\"・\"&K40&\"・\"&L40,IF(N40=\"\",I40&\"・\"&J40&\"・\"&K40&\"・\"&L40&\"・\"&M40,I40&\"・\"&J40&\"・\"&K40&\"・\"&L40&\"・\"&M40&\"・\"&N40))))))","v":""},"","","","",""]
[null,{"$f":"データリスト!G$46","v":"代表代議員会"},{"$f":"IF(データリスト!$G59=\"\",\"\",データリスト!$G59)","v":""},{"$nulls":17},{"$f":"IF(I41:N41=\"\",\"\",IF(J41:N41=\"\",I41,IF(K41:N41=\"\",I41&\"・\"&J41,IF(L41:N41=\"\",I41&\"・\"&J41&\"・\"&K41,IF(M41:N41=\"\",I41&\"・\"&J41&\"・\"&K41&\"・\"&L41,IF(N41=\"\",I41&\"・\"&J41&\"・\"&K41&\"・\"&L41&\"・\"&M41,I41&\"・\"&J41&\"・\"&K41&\"・\"&L41&\"・\"&M41&\"・\"&N41))))))","v":""},"","","","",""]
[null,{"$f":"データリスト!G$46","v":"代表代議員会"},{"$f":"IF(データリスト!$G60=\"\",\"\",データリスト!$G60)","v":""},{"$nulls":17},{"$f":"IF(I42:N42=\"\",\"\",IF(J42:N42=\"\",I42,IF(K42:N42=\"\",I42&\"・\"&J42,IF(L42:N42=\"\",I42&\"・\"&J42&\"・\"&K42,IF(M42:N42=\"\",I42&\"・\"&J42&\"・\"&K42&\"・\"&L42,IF(N42=\"\",I42&\"・\"&J42&\"・\"&K42&\"・\"&L42&\"・\"&M42,I42&\"・\"&J42&\"・\"&K42&\"・\"&L42&\"・\"&M42&\"・\"&N42))))))","v":""},"","","","",""]
[null,{"$f":"データリスト!G$46","v":"代表代議員会"},{"$f":"IF(データリスト!$G61=\"\",\"\",データリスト!$G61)","v":""},{"$nulls":17},{"$f":"IF(I43:N43=\"\",\"\",IF(J43:N43=\"\",I43,IF(K43:N43=\"\",I43&\"・\"&J43,IF(L43:N43=\"\",I43&\"・\"&J43&\"・\"&K43,IF(M43:N43=\"\",I43&\"・\"&J43&\"・\"&K43&\"・\"&L43,IF(N43=\"\",I43&\"・\"&J43&\"・\"&K43&\"・\"&L43&\"・\"&M43,I43&\"・\"&J43&\"・\"&K43&\"・\"&L43&\"・\"&M43&\"・\"&N43))))))","v":""},"","","","",""]
[null,{"$f":"データリスト!G$46","v":"代表代議員会"},{"$f":"IF(データリスト!$G62=\"\",\"\",データリスト!$G62)","v":""},{"$nulls":17},{"$f":"IF(I44:N44=\"\",\"\",IF(J44:N44=\"\",I44,IF(K44:N44=\"\",I44&\"・\"&J44,IF(L44:N44=\"\",I44&\"・\"&J44&\"・\"&K44,IF(M44:N44=\"\",I44&\"・\"&J44&\"・\"&K44&\"・\"&L44,IF(N44=\"\",I44&\"・\"&J44&\"・\"&K44&\"・\"&L44&\"・\"&M44,I44&\"・\"&J44&\"・\"&K44&\"・\"&L44&\"・\"&M44&\"・\"&N44))))))","v":""},"","","","",""]
[null,{"$f":"データリスト!G$46","v":"代表代議員会"},{"$f":"IF(データリスト!$G63=\"\",\"\",データリスト!$G63)","v":""},{"$nulls":17},{"$f":"IF(I45:N45=\"\",\"\",IF(J45:N45=\"\",I45,IF(K45:N45=\"\",I45&\"・\"&J45,IF(L45:N45=\"\",I45&\"・\"&J45&\"・\"&K45,IF(M45:N45=\"\",I45&\"・\"&J45&\"・\"&K45&\"・\"&L45,IF(N45=\"\",I45&\"・\"&J45&\"・\"&K45&\"・\"&L45&\"・\"&M45,I45&\"・\"&J45&\"・\"&K45&\"・\"&L45&\"・\"&M45&\"・\"&N45))))))","v":""},"","","","",""]
[null,{"$f":"データリスト!G$46","v":"代表代議員会"},{"$f":"IF(データリスト!$G64=\"\",\"\",データリスト!$G64)","v":""},{"$nulls":17},{"$f":"IF(I46:N46=\"\",\"\",IF(J46:N46=\"\",I46,IF(K46:N46=\"\",I46&\"・\"&J46,IF(L46:N46=\"\",I46&\"・\"&J46&\"・\"&K46,IF(M46:N46=\"\",I46&\"・\"&J46&\"・\"&K46&\"・\"&L46,IF(N46=\"\",I46&\"・\"&J46&\"・\"&K46&\"・\"&L46&\"・\"&M46,I46&\"・\"&J46&\"・\"&K46&\"・\"&L46&\"・\"&M46&\"・\"&N46))))))","v":""},"","","","",""]
[null,{"$f":"データリスト!G$46","v":"代表代議員会"},{"$f":"IF(データリスト!$G65=\"\",\"\",データリスト!$G65)","v":""},{"$nulls":17},{"$f":"IF(I47:N47=\"\",\"\",IF(J47:N47=\"\",I47,IF(K47:N47=\"\",I47&\"・\"&J47,IF(L47:N47=\"\",I47&\"・\"&J47&\"・\"&K47,IF(M47:N47=\"\",I47&\"・\"&J47&\"・\"&K47&\"・\"&L47,IF(N47=\"\",I47&\"・\"&J47&\"・\"&K47&\"・\"&L47&\"・\"&M47,I47&\"・\"&J47&\"・\"&K47&\"・\"&L47&\"・\"&M47&\"・\"&N47))))))","v":""},"","","","",""]
[null,{"$f":"データリスト!G$46","v":"代表代議員会"},{"$f":"IF(データリスト!$G66=\"\",\"\",データリスト!$G66)","v":""},{"$nulls":17},{"$f":"IF(I48:N48=\"\",\"\",IF(J48:N48=\"\",I48,IF(K48:N48=\"\",I48&\"・\"&J48,IF(L48:N48=\"\",I48&\"・\"&J48&\"・\"&K48,IF(M48:N48=\"\",I48&\"・\"&J48&\"・\"&K48&\"・\"&L48,IF(N48=\"\",I48&\"・\"&J48&\"・\"&K48&\"・\"&L48&\"・\"&M48,I48&\"・\"&J48&\"・\"&K48&\"・\"&L48&\"・\"&M48&\"・\"&N48))))))","v":""},"","","","",""]
[null,{"$f":"データリスト!H$46","v":"分会代表者会議"},{"$f":"IF(データリスト!$H47=\"\",\"\",データリスト!$H47)","v":"出欠確認・報告"},{"$nulls":17},{"$f":"IF(I49:N49=\"\",\"\",IF(J49:N49=\"\",I49,IF(K49:N49=\"\",I49&\"・\"&J49,IF(L49:N49=\"\",I49&\"・\"&J49&\"・\"&K49,IF(M49:N49=\"\",I49&\"・\"&J49&\"・\"&K49&\"・\"&L49,IF(N49=\"\",I49&\"・\"&J49&\"・\"&K49&\"・\"&L49&\"・\"&M49,I49&\"・\"&J49&\"・\"&K49&\"・\"&L49&\"・\"&M49&\"・\"&N49))))))","v":""},"","","","",""]
[null,{"$f":"データリスト!H$46","v":"分会代表者会議"},{"$f":"IF(データリスト!$H48=\"\",\"\",データリスト!$H48)","v":"会議出席"},{"$nulls":17},{"$f":"IF(I50:N50=\"\",\"\",IF(J50:N50=\"\",I50,IF(K50:N50=\"\",I50&\"・\"&J50,IF(L50:N50=\"\",I50&\"・\"&J50&\"・\"&K50,IF(M50:N50=\"\",I50&\"・\"&J50&\"・\"&K50&\"・\"&L50,IF(N50=\"\",I50&\"・\"&J50&\"・\"&K50&\"・\"&L50&\"・\"&M50,I50&\"・\"&J50&\"・\"&K50&\"・\"&L50&\"・\"&M50&\"・\"&N50))))))","v":""},"","","","",""]
[null,{"$f":"データリスト!H$46","v":"分会代表者会議"},{"$f":"IF(データリスト!$H49=\"\",\"\",データリスト!$H49)","v":"確認事項　職場周知"},{"$nulls":17},{"$f":"IF(I51:N51=\"\",\"\",IF(J51:N51=\"\",I51,IF(K51:N51=\"\",I51&\"・\"&J51,IF(L51:N51=\"\",I51&\"・\"&J51&\"・\"&K51,IF(M51:N51=\"\",I51&\"・\"&J51&\"・\"&K51&\"・\"&L51,IF(N51=\"\",I51&\"・\"&J51&\"・\"&K51&\"・\"&L51&\"・\"&M51,I51&\"・\"&J51&\"・\"&K51&\"・\"&L51&\"・\"&M51&\"・\"&N51))))))","v":""},"","","","",""]
[null,{"$f":"データリスト!H$46","v":"分会代表者会議"},{"$f":"IF(データリスト!$H50=\"\",\"\",データリスト!$H50)","v":""},{"$nulls":17},{"$f":"IF(I52:N52=\"\",\"\",IF(J52:N52=\"\",I52,IF(K52:N52=\"\",I52&\"・\"&J52,IF(L52:N52=\"\",I52&\"・\"&J52&\"・\"&K52,IF(M52:N52=\"\",I52&\"・\"&J52&\"・\"&K52&\"・\"&L52,IF(N52=\"\",I52&\"・\"&J52&\"・\"&K52&\"・\"&L52&\"・\"&M52,I52&\"・\"&J52&\"・\"&K52&\"・\"&L52&\"・\"&M52&\"・\"&N52))))))","v":""},"","","","",""]
[null,{"$f":"データリスト!H$46","v":"分会代表者会議"},{"$f":"IF(データリスト!$H51=\"\",\"\",データリスト!$H51)","v":""},{"$nulls":17},{"$f":"IF(I53:N53=\"\",\"\",IF(J53:N53=\"\",I53,IF(K53:N53=\"\",I53&\"・\"&J53,IF(L53:N53=\"\",I53&\"・\"&J53&\"・\"&K53,IF(M53:N53=\"\",I53&\"・\"&J53&\"・\"&K53&\"・\"&L53,IF(N53=\"\",I53&\"・\"&J53&\"・\"&K53&\"・\"&L53&\"・\"&M53,I53&\"・\"&J53&\"・\"&K53&\"・\"&L53&\"・\"&M53&\"・\"&N53))))))","v":""},"","","","",""]
[null,{"$f":"データリスト!H$46","v":"分会代表者会議"},{"$f":"IF(データリスト!$H52=\"\",\"\",データリスト!$H52)","v":""},{"$nulls":17},{"$f":"IF(I54:N54=\"\",\"\",IF(J54:N54=\"\",I54,IF(K54:N54=\"\",I54&\"・\"&J54,IF(L54:N54=\"\",I54&\"・\"&J54&\"・\"&K54,IF(M54:N54=\"\",I54&\"・\"&J54&\"・\"&K54&\"・\"&L54,IF(N54=\"\",I54&\"・\"&J54&\"・\"&K54&\"・\"&L54&\"・\"&M54,I54&\"・\"&J54&\"・\"&K54&\"・\"&L54&\"・\"&M54&\"・\"&N54))))))","v":""},"","","","",""]
[null,{"$f":"データリスト!H$46","v":"分会代表者会議"},{"$f":"IF(データリスト!$H53=\"\",\"\",データリスト!$H53)","v":""},{"$nulls":17},{"$f":"IF(I55:N55=\"\",\"\",IF(J55:N55=\"\",I55,IF(K55:N55=\"\",I55&\"・\"&J55,IF(L55:N55=\"\",I55&\"・\"&J55&\"・\"&K55,IF(M55:N55=\"\",I55&\"・\"&J55&\"・\"&K55&\"・\"&L55,IF(N55=\"\",I55&\"・\"&J55&\"・\"&K55&\"・\"&L55&\"・\"&M55,I55&\"・\"&J55&\"・\"&K55&\"・\"&L55&\"・\"&M55&\"・\"&N55))))))","v":""},"","","","",""]
[null,{"$f":"データリスト!H$46","v":"分会代表者会議"},{"$f":"IF(データリスト!$H54=\"\",\"\",データリスト!$H54)","v":""},{"$nulls":17},{"$f":"IF(I56:N56=\"\",\"\",IF(J56:N56=\"\",I56,IF(K56:N56=\"\",I56&\"・\"&J56,IF(L56:N56=\"\",I56&\"・\"&J56&\"・\"&K56,IF(M56:N56=\"\",I56&\"・\"&J56&\"・\"&K56&\"・\"&L56,IF(N56=\"\",I56&\"・\"&J56&\"・\"&K56&\"・\"&L56&\"・\"&M56,I56&\"・\"&J56&\"・\"&K56&\"・\"&L56&\"・\"&M56&\"・\"&N56))))))","v":""},"","","","",""]
[null,{"$f":"データリスト!H$46","v":"分会代表者会議"},{"$f":"IF(データリスト!$H55=\"\",\"\",データリスト!$H55)","v":""},{"$nulls":17},{"$f":"IF(I57:N57=\"\",\"\",IF(J57:N57=\"\",I57,IF(K57:N57=\"\",I57&\"・\"&J57,IF(L57:N57=\"\",I57&\"・\"&J57&\"・\"&K57,IF(M57:N57=\"\",I57&\"・\"&J57&\"・\"&K57&\"・\"&L57,IF(N57=\"\",I57&\"・\"&J57&\"・\"&K57&\"・\"&L57&\"・\"&M57,I57&\"・\"&J57&\"・\"&K57&\"・\"&L57&\"・\"&M57&\"・\"&N57))))))","v":""},"","","","",""]
[null,{"$f":"データリスト!H$46","v":"分会代表者会議"},{"$f":"IF(データリスト!$H56=\"\",\"\",データリスト!$H56)","v":""},{"$nulls":17},{"$f":"IF(I58:N58=\"\",\"\",IF(J58:N58=\"\",I58,IF(K58:N58=\"\",I58&\"・\"&J58,IF(L58:N58=\"\",I58&\"・\"&J58&\"・\"&K58,IF(M58:N58=\"\",I58&\"・\"&J58&\"・\"&K58&\"・\"&L58,IF(N58=\"\",I58&\"・\"&J58&\"・\"&K58&\"・\"&L58&\"・\"&M58,I58&\"・\"&J58&\"・\"&K58&\"・\"&L58&\"・\"&M58&\"・\"&N58))))))","v":""},"","","","",""]
[null,{"$f":"データリスト!H$46","v":"分会代表者会議"},{"$f":"IF(データリスト!$H57=\"\",\"\",データリスト!$H57)","v":""},{"$nulls":17},{"$f":"IF(I59:N59=\"\",\"\",IF(J59:N59=\"\",I59,IF(K59:N59=\"\",I59&\"・\"&J59,IF(L59:N59=\"\",I59&\"・\"&J59&\"・\"&K59,IF(M59:N59=\"\",I59&\"・\"&J59&\"・\"&K59&\"・\"&L59,IF(N59=\"\",I59&\"・\"&J59&\"・\"&K59&\"・\"&L59&\"・\"&M59,I59&\"・\"&J59&\"・\"&K59&\"・\"&L59&\"・\"&M59&\"・\"&N59))))))","v":""},"","","","",""]
[null,{"$f":"データリスト!H$46","v":"分会代表者会議"},{"$f":"IF(データリスト!$H58=\"\",\"\",データリスト!$H58)","v":""},{"$nulls":17},{"$f":"IF(I60:N60=\"\",\"\",IF(J60:N60=\"\",I60,IF(K60:N60=\"\",I60&\"・\"&J60,IF(L60:N60=\"\",I60&\"・\"&J60&\"・\"&K60,IF(M60:N60=\"\",I60&\"・\"&J60&\"・\"&K60&\"・\"&L60,IF(N60=\"\",I60&\"・\"&J60&\"・\"&K60&\"・\"&L60&\"・\"&M60,I60&\"・\"&J60&\"・\"&K60&\"・\"&L60&\"・\"&M60&\"・\"&N60))))))","v":""},"","","","",""]
[null,{"$f":"データリスト!H$46","v":"分会代表者会議"},{"$f":"IF(データリスト!$H59=\"\",\"\",データリスト!$H59)","v":""},{"$nulls":17},{"$f":"IF(I61:N61=\"\",\"\",IF(J61:N61=\"\",I61,IF(K61:N61=\"\",I61&\"・\"&J61,IF(L61:N61=\"\",I61&\"・\"&J61&\"・\"&K61,IF(M61:N61=\"\",I61&\"・\"&J61&\"・\"&K61&\"・\"&L61,IF(N61=\"\",I61&\"・\"&J61&\"・\"&K61&\"・\"&L61&\"・\"&M61,I61&\"・\"&J61&\"・\"&K61&\"・\"&L61&\"・\"&M61&\"・\"&N61))))))","v":""},"","","","",""]
[null,{"$f":"データリスト!H$46","v":"分会代表者会議"},{"$f":"IF(データリスト!$H60=\"\",\"\",データリスト!$H60)","v":""},{"$nulls":17},{"$f":"IF(I62:N62=\"\",\"\",IF(J62:N62=\"\",I62,IF(K62:N62=\"\",I62&\"・\"&J62,IF(L62:N62=\"\",I62&\"・\"&J62&\"・\"&K62,IF(M62:N62=\"\",I62&\"・\"&J62&\"・\"&K62&\"・\"&L62,IF(N62=\"\",I62&\"・\"&J62&\"・\"&K62&\"・\"&L62&\"・\"&M62,I62&\"・\"&J62&\"・\"&K62&\"・\"&L62&\"・\"&M62&\"・\"&N62))))))","v":""},"","","","",""]
[null,{"$f":"データリスト!H$46","v":"分会代表者会議"},{"$f":"IF(データリスト!$H61=\"\",\"\",データリスト!$H61)","v":""},{"$nulls":17},{"$f":"IF(I63:N63=\"\",\"\",IF(J63:N63=\"\",I63,IF(K63:N63=\"\",I63&\"・\"&J63,IF(L63:N63=\"\",I63&\"・\"&J63&\"・\"&K63,IF(M63:N63=\"\",I63&\"・\"&J63&\"・\"&K63&\"・\"&L63,IF(N63=\"\",I63&\"・\"&J63&\"・\"&K63&\"・\"&L63&\"・\"&M63,I63&\"・\"&J63&\"・\"&K63&\"・\"&L63&\"・\"&M63&\"・\"&N63))))))","v":""},"","","","",""]
[null,{"$f":"データリスト!H$46","v":"分会代表者会議"},{"$f":"IF(データリスト!$H62=\"\",\"\",データリスト!$H62)","v":""},{"$nulls":17},{"$f":"IF(I64:N64=\"\",\"\",IF(J64:N64=\"\",I64,IF(K64:N64=\"\",I64&\"・\"&J64,IF(L64:N64=\"\",I64&\"・\"&J64&\"・\"&K64,IF(M64:N64=\"\",I64&\"・\"&J64&\"・\"&K64&\"・\"&L64,IF(N64=\"\",I64&\"・\"&J64&\"・\"&K64&\"・\"&L64&\"・\"&M64,I64&\"・\"&J64&\"・\"&K64&\"・\"&L64&\"・\"&M64&\"・\"&N64))))))","v":""},"","","","",""]
[null,{"$f":"データリスト!H$46","v":"分会代表者会議"},{"$f":"IF(データリスト!$H63=\"\",\"\",データリスト!$H63)","v":""},{"$nulls":17},{"$f":"IF(I65:N65=\"\",\"\",IF(J65:N65=\"\",I65,IF(K65:N65=\"\",I65&\"・\"&J65,IF(L65:N65=\"\",I65&\"・\"&J65&\"・\"&K65,IF(M65:N65=\"\",I65&\"・\"&J65&\"・\"&K65&\"・\"&L65,IF(N65=\"\",I65&\"・\"&J65&\"・\"&K65&\"・\"&L65&\"・\"&M65,I65&\"・\"&J65&\"・\"&K65&\"・\"&L65&\"・\"&M65&\"・\"&N65))))))","v":""},"","","","",""]
[null,{"$f":"データリスト!H$46","v":"分会代表者会議"},{"$f":"IF(データリスト!$H64=\"\",\"\",データリスト!$H64)","v":""},{"$nulls":17},{"$f":"IF(I66:N66=\"\",\"\",IF(J66:N66=\"\",I66,IF(K66:N66=\"\",I66&\"・\"&J66,IF(L66:N66=\"\",I66&\"・\"&J66&\"・\"&K66,IF(M66:N66=\"\",I66&\"・\"&J66&\"・\"&K66&\"・\"&L66,IF(N66=\"\",I66&\"・\"&J66&\"・\"&K66&\"・\"&L66&\"・\"&M66,I66&\"・\"&J66&\"・\"&K66&\"・\"&L66&\"・\"&M66&\"・\"&N66))))))","v":""},"","","","",""]
[null,{"$f":"データリスト!H$46","v":"分会代表者会議"},{"$f":"IF(データリスト!$H65=\"\",\"\",データリスト!$H65)","v":""},{"$nulls":17},{"$f":"IF(I67:N67=\"\",\"\",IF(J67:N67=\"\",I67,IF(K67:N67=\"\",I67&\"・\"&J67,IF(L67:N67=\"\",I67&\"・\"&J67&\"・\"&K67,IF(M67:N67=\"\",I67&\"・\"&J67&\"・\"&K67&\"・\"&L67,IF(N67=\"\",I67&\"・\"&J67&\"・\"&K67&\"・\"&L67&\"・\"&M67,I67&\"・\"&J67&\"・\"&K67&\"・\"&L67&\"・\"&M67&\"・\"&N67))))))","v":""},"","","","",""]
[null,{"$f":"データリスト!H$46","v":"分会代表者会議"},{"$f":"IF(データリスト!$H66=\"\",\"\",データリスト!$H66)","v":""},{"$nulls":17},{"$f":"IF(I68:N68=\"\",\"\",IF(J68:N68=\"\",I68,IF(K68:N68=\"\",I68&\"・\"&J68,IF(L68:N68=\"\",I68&\"・\"&J68&\"・\"&K68,IF(M68:N68=\"\",I68&\"・\"&J68&\"・\"&K68&\"・\"&L68,IF(N68=\"\",I68&\"・\"&J68&\"・\"&K68&\"・\"&L68&\"・\"&M68,I68&\"・\"&J68&\"・\"&K68&\"・\"&L68&\"・\"&M68&\"・\"&N68))))))","v":""},"","","","",""]
[null,{"$f":"データリスト!I$46","v":"分会三役会議"},{"$f":"IF(データリスト!$I47=\"\",\"\",データリスト!$I47)","v":"出欠確認・報告"},{"$nulls":17},{"$f":"IF(I69:N69=\"\",\"\",IF(J69:N69=\"\",I69,IF(K69:N69=\"\",I69&\"・\"&J69,IF(L69:N69=\"\",I69&\"・\"&J69&\"・\"&K69,IF(M69:N69=\"\",I69&\"・\"&J69&\"・\"&K69&\"・\"&L69,IF(N69=\"\",I69&\"・\"&J69&\"・\"&K69&\"・\"&L69&\"・\"&M69,I69&\"・\"&J69&\"・\"&K69&\"・\"&L69&\"・\"&M69&\"・\"&N69))))))","v":""},"","","","",""]
[null,{"$f":"データリスト!I$46","v":"分会三役会議"},{"$f":"IF(データリスト!$I48=\"\",\"\",データリスト!$I48)","v":"会議出席"},{"$nulls":17},{"$f":"IF(I70:N70=\"\",\"\",IF(J70:N70=\"\",I70,IF(K70:N70=\"\",I70&\"・\"&J70,IF(L70:N70=\"\",I70&\"・\"&J70&\"・\"&K70,IF(M70:N70=\"\",I70&\"・\"&J70&\"・\"&K70&\"・\"&L70,IF(N70=\"\",I70&\"・\"&J70&\"・\"&K70&\"・\"&L70&\"・\"&M70,I70&\"・\"&J70&\"・\"&K70&\"・\"&L70&\"・\"&M70&\"・\"&N70))))))","v":""},"","","","",""]
[null,{"$f":"データリスト!I$46","v":"分会三役会議"},{"$f":"IF(データリスト!$I49=\"\",\"\",データリスト!$I49)","v":"確認事項　職場周知"},{"$nulls":17},{"$f":"IF(I71:N71=\"\",\"\",IF(J71:N71=\"\",I71,IF(K71:N71=\"\",I71&\"・\"&J71,IF(L71:N71=\"\",I71&\"・\"&J71&\"・\"&K71,IF(M71:N71=\"\",I71&\"・\"&J71&\"・\"&K71&\"・\"&L71,IF(N71=\"\",I71&\"・\"&J71&\"・\"&K71&\"・\"&L71&\"・\"&M71,I71&\"・\"&J71&\"・\"&K71&\"・\"&L71&\"・\"&M71&\"・\"&N71))))))","v":""},"","","","",""]
[null,{"$f":"データリスト!I$46","v":"分会三役会議"},{"$f":"IF(データリスト!$I50=\"\",\"\",データリスト!$I50)","v":""},{"$nulls":17},{"$f":"IF(I72:N72=\"\",\"\",IF(J72:N72=\"\",I72,IF(K72:N72=\"\",I72&\"・\"&J72,IF(L72:N72=\"\",I72&\"・\"&J72&\"・\"&K72,IF(M72:N72=\"\",I72&\"・\"&J72&\"・\"&K72&\"・\"&L72,IF(N72=\"\",I72&\"・\"&J72&\"・\"&K72&\"・\"&L72&\"・\"&M72,I72&\"・\"&J72&\"・\"&K72&\"・\"&L72&\"・\"&M72&\"・\"&N72))))))","v":""},"","","","",""]
[null,{"$f":"データリスト!I$46","v":"分会三役会議"},{"$f":"IF(データリスト!$I51=\"\",\"\",データリスト!$I51)","v":""},{"$nulls":17},{"$f":"IF(I73:N73=\"\",\"\",IF(J73:N73=\"\",I73,IF(K73:N73=\"\",I73&\"・\"&J73,IF(L73:N73=\"\",I73&\"・\"&J73&\"・\"&K73,IF(M73:N73=\"\",I73&\"・\"&J73&\"・\"&K73&\"・\"&L73,IF(N73=\"\",I73&\"・\"&J73&\"・\"&K73&\"・\"&L73&\"・\"&M73,I73&\"・\"&J73&\"・\"&K73&\"・\"&L73&\"・\"&M73&\"・\"&N73))))))","v":""},"","","","",""]
[null,{"$f":"データリスト!I$46","v":"分会三役会議"},{"$f":"IF(データリスト!$I52=\"\",\"\",データリスト!$I52)","v":""},{"$nulls":17},{"$f":"IF(I74:N74=\"\",\"\",IF(J74:N74=\"\",I74,IF(K74:N74=\"\",I74&\"・\"&J74,IF(L74:N74=\"\",I74&\"・\"&J74&\"・\"&K74,IF(M74:N74=\"\",I74&\"・\"&J74&\"・\"&K74&\"・\"&L74,IF(N74=\"\",I74&\"・\"&J74&\"・\"&K74&\"・\"&L74&\"・\"&M74,I74&\"・\"&J74&\"・\"&K74&\"・\"&L74&\"・\"&M74&\"・\"&N74))))))","v":""},"","","","",""]
[null,{"$f":"データリスト!I$46","v":"分会三役会議"},{"$f":"IF(データリスト!$I53=\"\",\"\",データリスト!$I53)","v":""},{"$nulls":17},{"$f":"IF(I75:N75=\"\",\"\",IF(J75:N75=\"\",I75,IF(K75:N75=\"\",I75&\"・\"&J75,IF(L75:N75=\"\",I75&\"・\"&J75&\"・\"&K75,IF(M75:N75=\"\",I75&\"・\"&J75&\"・\"&K75&\"・\"&L75,IF(N75=\"\",I75&\"・\"&J75&\"・\"&K75&\"・\"&L75&\"・\"&M75,I75&\"・\"&J75&\"・\"&K75&\"・\"&L75&\"・\"&M75&\"・\"&N75))))))","v":""},"","","","",""]
[null,{"$f":"データリスト!I$46","v":"分会三役会議"},{"$f":"IF(データリスト!$I54=\"\",\"\",データリスト!$I54)","v":""},{"$nulls":17},{"$f":"IF(I76:N76=\"\",\"\",IF(J76:N76=\"\",I76,IF(K76:N76=\"\",I76&\"・\"&J76,IF(L76:N76=\"\",I76&\"・\"&J76&\"・\"&K76,IF(M76:N76=\"\",I76&\"・\"&J76&\"・\"&K76&\"・\"&L76,IF(N76=\"\",I76&\"・\"&J76&\"・\"&K76&\"・\"&L76&\"・\"&M76,I76&\"・\"&J76&\"・\"&K76&\"・\"&L76&\"・\"&M76&\"・\"&N76))))))","v":""},"","","","",""]
[null,{"$f":"データリスト!I$46","v":"分会三役会議"},{"$f":"IF(データリスト!$I55=\"\",\"\",データリスト!$I55)","v":""},{"$nulls":17},{"$f":"IF(I77:N77=\"\",\"\",IF(J77:N77=\"\",I77,IF(K77:N77=\"\",I77&\"・\"&J77,IF(L77:N77=\"\",I77&\"・\"&J77&\"・\"&K77,IF(M77:N77=\"\",I77&\"・\"&J77&\"・\"&K77&\"・\"&L77,IF(N77=\"\",I77&\"・\"&J77&\"・\"&K77&\"・\"&L77&\"・\"&M77,I77&\"・\"&J77&\"・\"&K77&\"・\"&L77&\"・\"&M77&\"・\"&N77))))))","v":""},"","","","",""]
[null,{"$f":"データリスト!I$46","v":"分会三役会議"},{"$f":"IF(データリスト!$I56=\"\",\"\",データリスト!$I56)","v":""},{"$nulls":17},{"$f":"IF(I78:N78=\"\",\"\",IF(J78:N78=\"\",I78,IF(K78:N78=\"\",I78&\"・\"&J78,IF(L78:N78=\"\",I78&\"・\"&J78&\"・\"&K78,IF(M78:N78=\"\",I78&\"・\"&J78&\"・\"&K78&\"・\"&L78,IF(N78=\"\",I78&\"・\"&J78&\"・\"&K78&\"・\"&L78&\"・\"&M78,I78&\"・\"&J78&\"・\"&K78&\"・\"&L78&\"・\"&M78&\"・\"&N78))))))","v":""},"","","","",""]
[null,{"$f":"データリスト!I$46","v":"分会三役会議"},{"$f":"IF(データリスト!$I57=\"\",\"\",データリスト!$I57)","v":""},{"$nulls":17},{"$f":"IF(I79:N79=\"\",\"\",IF(J79:N79=\"\",I79,IF(K79:N79=\"\",I79&\"・\"&J79,IF(L79:N79=\"\",I79&\"・\"&J79&\"・\"&K79,IF(M79:N79=\"\",I79&\"・\"&J79&\"・\"&K79&\"・\"&L79,IF(N79=\"\",I79&\"・\"&J79&\"・\"&K79&\"・\"&L79&\"・\"&M79,I79&\"・\"&J79&\"・\"&K79&\"・\"&L79&\"・\"&M79&\"・\"&N79))))))","v":""},"","","","",""]
[null,{"$f":"データリスト!I$46","v":"分会三役会議"},{"$f":"IF(データリスト!$I58=\"\",\"\",データリスト!$I58)","v":""},{"$nulls":17},{"$f":"IF(I80:N80=\"\",\"\",IF(J80:N80=\"\",I80,IF(K80:N80=\"\",I80&\"・\"&J80,IF(L80:N80=\"\",I80&\"・\"&J80&\"・\"&K80,IF(M80:N80=\"\",I80&\"・\"&J80&\"・\"&K80&\"・\"&L80,IF(N80=\"\",I80&\"・\"&J80&\"・\"&K80&\"・\"&L80&\"・\"&M80,I80&\"・\"&J80&\"・\"&K80&\"・\"&L80&\"・\"&M80&\"・\"&N80))))))","v":""},"","","","",""]
[null,{"$f":"データリスト!I$46","v":"分会三役会議"},{"$f":"IF(データリスト!$I59=\"\",\"\",データリスト!$I59)","v":""},{"$nulls":17},{"$f":"IF(I81:N81=\"\",\"\",IF(J81:N81=\"\",I81,IF(K81:N81=\"\",I81&\"・\"&J81,IF(L81:N81=\"\",I81&\"・\"&J81&\"・\"&K81,IF(M81:N81=\"\",I81&\"・\"&J81&\"・\"&K81&\"・\"&L81,IF(N81=\"\",I81&\"・\"&J81&\"・\"&K81&\"・\"&L81&\"・\"&M81,I81&\"・\"&J81&\"・\"&K81&\"・\"&L81&\"・\"&M81&\"・\"&N81))))))","v":""},"","","","",""]
[null,{"$f":"データリスト!I$46","v":"分会三役会議"},{"$f":"IF(データリスト!$I60=\"\",\"\",データリスト!$I60)","v":""},{"$nulls":17},{"$f":"IF(I82:N82=\"\",\"\",IF(J82:N82=\"\",I82,IF(K82:N82=\"\",I82&\"・\"&J82,IF(L82:N82=\"\",I82&\"・\"&J82&\"・\"&K82,IF(M82:N82=\"\",I82&\"・\"&J82&\"・\"&K82&\"・\"&L82,IF(N82=\"\",I82&\"・\"&J82&\"・\"&K82&\"・\"&L82&\"・\"&M82,I82&\"・\"&J82&\"・\"&K82&\"・\"&L82&\"・\"&M82&\"・\"&N82))))))","v":""},"","","","",""]
[null,{"$f":"データリスト!I$46","v":"分会三役会議"},{"$f":"IF(データリスト!$I61=\"\",\"\",データリスト!$I61)","v":""},{"$nulls":17},{"$f":"IF(I83:N83=\"\",\"\",IF(J83:N83=\"\",I83,IF(K83:N83=\"\",I83&\"・\"&J83,IF(L83:N83=\"\",I83&\"・\"&J83&\"・\"&K83,IF(M83:N83=\"\",I83&\"・\"&J83&\"・\"&K83&\"・\"&L83,IF(N83=\"\",I83&\"・\"&J83&\"・\"&K83&\"・\"&L83&\"・\"&M83,I83&\"・\"&J83&\"・\"&K83&\"・\"&L83&\"・\"&M83&\"・\"&N83))))))","v":""},"","","","",""]
[null,{"$f":"データリスト!I$46","v":"分会三役会議"},{"$f":"IF(データリスト!$I62=\"\",\"\",データリスト!$I62)","v":""},{"$nulls":17},{"$f":"IF(I84:N84=\"\",\"\",IF(J84:N84=\"\",I84,IF(K84:N84=\"\",I84&\"・\"&J84,IF(L84:N84=\"\",I84&\"・\"&J84&\"・\"&K84,IF(M84:N84=\"\",I84&\"・\"&J84&\"・\"&K84&\"・\"&L84,IF(N84=\"\",I84&\"・\"&J84&\"・\"&K84&\"・\"&L84&\"・\"&M84,I84&\"・\"&J84&\"・\"&K84&\"・\"&L84&\"・\"&M84&\"・\"&N84))))))","v":""},"","","","",""]
[null,{"$f":"データリスト!I$46","v":"分会三役会議"},{"$f":"IF(データリスト!$I63=\"\",\"\",データリスト!$I63)","v":""},{"$nulls":17},{"$f":"IF(I85:N85=\"\",\"\",IF(J85:N85=\"\",I85,IF(K85:N85=\"\",I85&\"・\"&J85,IF(L85:N85=\"\",I85&\"・\"&J85&\"・\"&K85,IF(M85:N85=\"\",I85&\"・\"&J85&\"・\"&K85&\"・\"&L85,IF(N85=\"\",I85&\"・\"&J85&\"・\"&K85&\"・\"&L85&\"・\"&M85,I85&\"・\"&J85&\"・\"&K85&\"・\"&L85&\"・\"&M85&\"・\"&N85))))))","v":""},"","","","",""]
[null,{"$f":"データリスト!I$46","v":"分会三役会議"},{"$f":"IF(データリスト!$I64=\"\",\"\",データリスト!$I64)","v":""},{"$nulls":17},{"$f":"IF(I86:N86=\"\",\"\",IF(J86:N86=\"\",I86,IF(K86:N86=\"\",I86&\"・\"&J86,IF(L86:N86=\"\",I86&\"・\"&J86&\"・\"&K86,IF(M86:N86=\"\",I86&\"・\"&J86&\"・\"&K86&\"・\"&L86,IF(N86=\"\",I86&\"・\"&J86&\"・\"&K86&\"・\"&L86&\"・\"&M86,I86&\"・\"&J86&\"・\"&K86&\"・\"&L86&\"・\"&M86&\"・\"&N86))))))","v":""},"","","","",""]
[null,{"$f":"データリスト!I$46","v":"分会三役会議"},{"$f":"IF(データリスト!$I65=\"\",\"\",データリスト!$I65)","v":""},{"$nulls":17},{"$f":"IF(I87:N87=\"\",\"\",IF(J87:N87=\"\",I87,IF(K87:N87=\"\",I87&\"・\"&J87,IF(L87:N87=\"\",I87&\"・\"&J87&\"・\"&K87,IF(M87:N87=\"\",I87&\"・\"&J87&\"・\"&K87&\"・\"&L87,IF(N87=\"\",I87&\"・\"&J87&\"・\"&K87&\"・\"&L87&\"・\"&M87,I87&\"・\"&J87&\"・\"&K87&\"・\"&L87&\"・\"&M87&\"・\"&N87))))))","v":""},"","","","",""]
[null,{"$f":"データリスト!I$46","v":"分会三役会議"},{"$f":"IF(データリスト!$I66=\"\",\"\",データリスト!$I66)","v":""},{"$nulls":17},{"$f":"IF(I88:N88=\"\",\"\",IF(J88:N88=\"\",I88,IF(K88:N88=\"\",I88&\"・\"&J88,IF(L88:N88=\"\",I88&\"・\"&J88&\"・\"&K88,IF(M88:N88=\"\",I88&\"・\"&J88&\"・\"&K88&\"・\"&L88,IF(N88=\"\",I88&\"・\"&J88&\"・\"&K88&\"・\"&L88&\"・\"&M88,I88&\"・\"&J88&\"・\"&K88&\"・\"&L88&\"・\"&M88&\"・\"&N88))))))","v":""},"","","","",""]
[null,{"$f":"データリスト!J$46","v":"職場オルグ"},{"$f":"IF(データリスト!$J47=\"\",\"\",データリスト!$J47)","v":"日程調整"},{"$nulls":17},{"$f":"IF(I89:N89=\"\",\"\",IF(J89:N89=\"\",I89,IF(K89:N89=\"\",I89&\"・\"&J89,IF(L89:N89=\"\",I89&\"・\"&J89&\"・\"&K89,IF(M89:N89=\"\",I89&\"・\"&J89&\"・\"&K89&\"・\"&L89,IF(N89=\"\",I89&\"・\"&J89&\"・\"&K89&\"・\"&L89&\"・\"&M89,I89&\"・\"&J89&\"・\"&K89&\"・\"&L89&\"・\"&M89&\"・\"&N89))))))","v":""},"","","","",""]
[null,{"$f":"データリスト!J$46","v":"職場オルグ"},{"$f":"IF(データリスト!$J48=\"\",\"\",データリスト!$J48)","v":"開催周知(会社・職場)"},{"$nulls":17},{"$f":"IF(I90:N90=\"\",\"\",IF(J90:N90=\"\",I90,IF(K90:N90=\"\",I90&\"・\"&J90,IF(L90:N90=\"\",I90&\"・\"&J90&\"・\"&K90,IF(M90:N90=\"\",I90&\"・\"&J90&\"・\"&K90&\"・\"&L90,IF(N90=\"\",I90&\"・\"&J90&\"・\"&K90&\"・\"&L90&\"・\"&M90,I90&\"・\"&J90&\"・\"&K90&\"・\"&L90&\"・\"&M90&\"・\"&N90))))))","v":""},"","","","",""]
[null,{"$f":"データリスト!J$46","v":"職場オルグ"},{"$f":"IF(データリスト!$J49=\"\",\"\",データリスト!$J49)","v":"会場設営"},{"$nulls":17},{"$f":"IF(I91:N91=\"\",\"\",IF(J91:N91=\"\",I91,IF(K91:N91=\"\",I91&\"・\"&J91,IF(L91:N91=\"\",I91&\"・\"&J91&\"・\"&K91,IF(M91:N91=\"\",I91&\"・\"&J91&\"・\"&K91&\"・\"&L91,IF(N91=\"\",I91&\"・\"&J91&\"・\"&K91&\"・\"&L91&\"・\"&M91,I91&\"・\"&J91&\"・\"&K91&\"・\"&L91&\"・\"&M91&\"・\"&N91))))))","v":""},"","","","",""]
[null,{"$f":"データリスト!J$46","v":"職場オルグ"},{"$f":"IF(データリスト!$J50=\"\",\"\",データリスト!$J50)","v":"オルグの開催"},{"$nulls":17},{"$f":"IF(I92:N92=\"\",\"\",IF(J92:N92=\"\",I92,IF(K92:N92=\"\",I92&\"・\"&J92,IF(L92:N92=\"\",I92&\"・\"&J92&\"・\"&K92,IF(M92:N92=\"\",I92&\"・\"&J92&\"・\"&K92&\"・\"&L92,IF(N92=\"\",I92&\"・\"&J92&\"・\"&K92&\"・\"&L92&\"・\"&M92,I92&\"・\"&J92&\"・\"&K92&\"・\"&L92&\"・\"&M92&\"・\"&N92))))))","v":""},"","","","",""]
[null,{"$f":"データリスト!J$46","v":"職場オルグ"},{"$f":"IF(データリスト!$J51=\"\",\"\",データリスト!$J51)","v":"会場片付け"},{"$nulls":17},{"$f":"IF(I93:N93=\"\",\"\",IF(J93:N93=\"\",I93,IF(K93:N93=\"\",I93&\"・\"&J93,IF(L93:N93=\"\",I93&\"・\"&J93&\"・\"&K93,IF(M93:N93=\"\",I93&\"・\"&J93&\"・\"&K93&\"・\"&L93,IF(N93=\"\",I93&\"・\"&J93&\"・\"&K93&\"・\"&L93&\"・\"&M93,I93&\"・\"&J93&\"・\"&K93&\"・\"&L93&\"・\"&M93&\"・\"&N93))))))","v":""},"","","","",""]
[null,{"$f":"データリスト!J$46","v":"職場オルグ"},{"$f":"IF(データリスト!$J52=\"\",\"\",データリスト!$J52)","v":""},{"$nulls":17},{"$f":"IF(I94:N94=\"\",\"\",IF(J94:N94=\"\",I94,IF(K94:N94=\"\",I94&\"・\"&J94,IF(L94:N94=\"\",I94&\"・\"&J94&\"・\"&K94,IF(M94:N94=\"\",I94&\"・\"&J94&\"・\"&K94&\"・\"&L94,IF(N94=\"\",I94&\"・\"&J94&\"・\"&K94&\"・\"&L94&\"・\"&M94,I94&\"・\"&J94&\"・\"&K94&\"・\"&L94&\"・\"&M94&\"・\"&N94))))))","v":""},"","","","",""]
[null,{"$f":"データリスト!J$46","v":"職場オルグ"},{"$f":"IF(データリスト!$J53=\"\",\"\",データリスト!$J53)","v":""},{"$nulls":17},{"$f":"IF(I95:N95=\"\",\"\",IF(J95:N95=\"\",I95,IF(K95:N95=\"\",I95&\"・\"&J95,IF(L95:N95=\"\",I95&\"・\"&J95&\"・\"&K95,IF(M95:N95=\"\",I95&\"・\"&J95&\"・\"&K95&\"・\"&L95,IF(N95=\"\",I95&\"・\"&J95&\"・\"&K95&\"・\"&L95&\"・\"&M95,I95&\"・\"&J95&\"・\"&K95&\"・\"&L95&\"・\"&M95&\"・\"&N95))))))","v":""},"","","","",""]
[null,{"$f":"データリスト!J$46","v":"職場オルグ"},{"$f":"IF(データリスト!$J54=\"\",\"\",データリスト!$J54)","v":""},{"$nulls":17},{"$f":"IF(I96:N96=\"\",\"\",IF(J96:N96=\"\",I96,IF(K96:N96=\"\",I96&\"・\"&J96,IF(L96:N96=\"\",I96&\"・\"&J96&\"・\"&K96,IF(M96:N96=\"\",I96&\"・\"&J96&\"・\"&K96&\"・\"&L96,IF(N96=\"\",I96&\"・\"&J96&\"・\"&K96&\"・\"&L96&\"・\"&M96,I96&\"・\"&J96&\"・\"&K96&\"・\"&L96&\"・\"&M96&\"・\"&N96))))))","v":""},"","","","",""]
[null,{"$f":"データリスト!J$46","v":"職場オルグ"},{"$f":"IF(データリスト!$J55=\"\",\"\",データリスト!$J55)","v":""},{"$nulls":17},{"$f":"IF(I97:N97=\"\",\"\",IF(J97:N97=\"\",I97,IF(K97:N97=\"\",I97&\"・\"&J97,IF(L97:N97=\"\",I97&\"・\"&J97&\"・\"&K97,IF(M97:N97=\"\",I97&\"・\"&J97&\"・\"&K97&\"・\"&L97,IF(N97=\"\",I97&\"・\"&J97&\"・\"&K97&\"・\"&L97&\"・\"&M97,I97&\"・\"&J97&\"・\"&K97&\"・\"&L97&\"・\"&M97&\"・\"&N97))))))","v":""},"","","","",""]
[null,{"$f":"データリスト!J$46","v":"職場オルグ"},{"$f":"IF(データリスト!$J56=\"\",\"\",データリスト!$J56)","v":""},{"$nulls":17},{"$f":"IF(I98:N98=\"\",\"\",IF(J98:N98=\"\",I98,IF(K98:N98=\"\",I98&\"・\"&J98,IF(L98:N98=\"\",I98&\"・\"&J98&\"・\"&K98,IF(M98:N98=\"\",I98&\"・\"&J98&\"・\"&K98&\"・\"&L98,IF(N98=\"\",I98&\"・\"&J98&\"・\"&K98&\"・\"&L98&\"・\"&M98,I98&\"・\"&J98&\"・\"&K98&\"・\"&L98&\"・\"&M98&\"・\"&N98))))))","v":""},"","","","",""]
[null,{"$f":"データリスト!J$46","v":"職場オルグ"},{"$f":"IF(データリスト!$J57=\"\",\"\",データリスト!$J57)","v":""},{"$nulls":17},{"$f":"IF(I99:N99=\"\",\"\",IF(J99:N99=\"\",I99,IF(K99:N99=\"\",I99&\"・\"&J99,IF(L99:N99=\"\",I99&\"・\"&J99&\"・\"&K99,IF(M99:N99=\"\",I99&\"・\"&J99&\"・\"&K99&\"・\"&L99,IF(N99=\"\",I99&\"・\"&J99&\"・\"&K99&\"・\"&L99&\"・\"&M99,I99&\"・\"&J99&\"・\"&K99&\"・\"&L99&\"・\"&M99&\"・\"&N99))))))","v":""},"","","","",""]
[null,{"$f":"データリスト!J$46","v":"職場オルグ"},{"$f":"IF(データリスト!$J58=\"\",\"\",データリスト!$J58)","v":""},{"$nulls":17},{"$f":"IF(I100:N100=\"\",\"\",IF(J100:N100=\"\",I100,IF(K100:N100=\"\",I100&\"・\"&J100,IF(L100:N100=\"\",I100&\"・\"&J100&\"・\"&K100,IF(M100:N100=\"\",I100&\"・\"&J100&\"・\"&K100&\"・\"&L100,IF(N100=\"\",I100&\"・\"&J100&\"・\"&K100&\"・\"&L100&\"・\"&M100,I100&\"・\"&J100&\"・\"&K100&\"・\"&L100&\"・\"&M100&\"・\"&N100))))))","v":""},"","","","",""]
[null,{"$f":"データリスト!J$46","v":"職場オルグ"},{"$f":"IF(データリスト!$J59=\"\",\"\",データリスト!$J59)","v":""},{"$nulls":17},{"$f":"IF(I101:N101=\"\",\"\",IF(J101:N101=\"\",I101,IF(K101:N101=\"\",I101&\"・\"&J101,IF(L101:N101=\"\",I101&\"・\"&J101&\"・\"&K101,IF(M101:N101=\"\",I101&\"・\"&J101&\"・\"&K101&\"・\"&L101,IF(N101=\"\",I101&\"・\"&J101&\"・\"&K101&\"・\"&L101&\"・\"&M101,I101&\"・\"&J101&\"・\"&K101&\"・\"&L101&\"・\"&M101&\"・\"&N101))))))","v":""},"","","","",""]
[null,{"$f":"データリスト!J$46","v":"職場オルグ"},{"$f":"IF(データリスト!$J60=\"\",\"\",データリスト!$J60)","v":""},{"$nulls":17},{"$f":"IF(I102:N102=\"\",\"\",IF(J102:N102=\"\",I102,IF(K102:N102=\"\",I102&\"・\"&J102,IF(L102:N102=\"\",I102&\"・\"&J102&\"・\"&K102,IF(M102:N102=\"\",I102&\"・\"&J102&\"・\"&K102&\"・\"&L102,IF(N102=\"\",I102&\"・\"&J102&\"・\"&K102&\"・\"&L102&\"・\"&M102,I102&\"・\"&J102&\"・\"&K102&\"・\"&L102&\"・\"&M102&\"・\"&N102))))))","v":""},"","","","",""]
[null,{"$f":"データリスト!J$46","v":"職場オルグ"},{"$f":"IF(データリスト!$J61=\"\",\"\",データリスト!$J61)","v":""},{"$nulls":17},{"$f":"IF(I103:N103=\"\",\"\",IF(J103:N103=\"\",I103,IF(K103:N103=\"\",I103&\"・\"&J103,IF(L103:N103=\"\",I103&\"・\"&J103&\"・\"&K103,IF(M103:N103=\"\",I103&\"・\"&J103&\"・\"&K103&\"・\"&L103,IF(N103=\"\",I103&\"・\"&J103&\"・\"&K103&\"・\"&L103&\"・\"&M103,I103&\"・\"&J103&\"・\"&K103&\"・\"&L103&\"・\"&M103&\"・\"&N103))))))","v":""},"","","","",""]
[null,{"$f":"データリスト!J$46","v":"職場オルグ"},{"$f":"IF(データリスト!$J62=\"\",\"\",データリスト!$J62)","v":""},{"$nulls":17},{"$f":"IF(I104:N104=\"\",\"\",IF(J104:N104=\"\",I104,IF(K104:N104=\"\",I104&\"・\"&J104,IF(L104:N104=\"\",I104&\"・\"&J104&\"・\"&K104,IF(M104:N104=\"\",I104&\"・\"&J104&\"・\"&K104&\"・\"&L104,IF(N104=\"\",I104&\"・\"&J104&\"・\"&K104&\"・\"&L104&\"・\"&M104,I104&\"・\"&J104&\"・\"&K104&\"・\"&L104&\"・\"&M104&\"・\"&N104))))))","v":""},"","","","",""]
[null,{"$f":"データリスト!J$46","v":"職場オルグ"},{"$f":"IF(データリスト!$J63=\"\",\"\",データリスト!$J63)","v":""},{"$nulls":17},{"$f":"IF(I105:N105=\"\",\"\",IF(J105:N105=\"\",I105,IF(K105:N105=\"\",I105&\"・\"&J105,IF(L105:N105=\"\",I105&\"・\"&J105&\"・\"&K105,IF(M105:N105=\"\",I105&\"・\"&J105&\"・\"&K105&\"・\"&L105,IF(N105=\"\",I105&\"・\"&J105&\"・\"&K105&\"・\"&L105&\"・\"&M105,I105&\"・\"&J105&\"・\"&K105&\"・\"&L105&\"・\"&M105&\"・\"&N105))))))","v":""},"","","","",""]
[null,{"$f":"データリスト!J$46","v":"職場オルグ"},{"$f":"IF(データリスト!$J64=\"\",\"\",データリスト!$J64)","v":""},{"$nulls":17},{"$f":"IF(I106:N106=\"\",\"\",IF(J106:N106=\"\",I106,IF(K106:N106=\"\",I106&\"・\"&J106,IF(L106:N106=\"\",I106&\"・\"&J106&\"・\"&K106,IF(M106:N106=\"\",I106&\"・\"&J106&\"・\"&K106&\"・\"&L106,IF(N106=\"\",I106&\"・\"&J106&\"・\"&K106&\"・\"&L106&\"・\"&M106,I106&\"・\"&J106&\"・\"&K106&\"・\"&L106&\"・\"&M106&\"・\"&N106))))))","v":""},"","","","",""]
[null,{"$f":"データリスト!J$46","v":"職場オルグ"},{"$f":"IF(データリスト!$J65=\"\",\"\",データリスト!$J65)","v":""},{"$nulls":17},{"$f":"IF(I107:N107=\"\",\"\",IF(J107:N107=\"\",I107,IF(K107:N107=\"\",I107&\"・\"&J107,IF(L107:N107=\"\",I107&\"・\"&J107&\"・\"&K107,IF(M107:N107=\"\",I107&\"・\"&J107&\"・\"&K107&\"・\"&L107,IF(N107=\"\",I107&\"・\"&J107&\"・\"&K107&\"・\"&L107&\"・\"&M107,I107&\"・\"&J107&\"・\"&K107&\"・\"&L107&\"・\"&M107&\"・\"&N107))))))","v":""},"","","","",""]
[null,{"$f":"データリスト!J$46","v":"職場オルグ"},{"$f":"IF(データリスト!$J66=\"\",\"\",データリスト!$J66)","v":""},{"$nulls":17},{"$f":"IF(I108:N108=\"\",\"\",IF(J108:N108=\"\",I108,IF(K108:N108=\"\",I108&\"・\"&J108,IF(L108:N108=\"\",I108&\"・\"&J108&\"・\"&K108,IF(M108:N108=\"\",I108&\"・\"&J108&\"・\"&K108&\"・\"&L108,IF(N108=\"\",I108&\"・\"&J108&\"・\"&K108&\"・\"&L108&\"・\"&M108,I108&\"・\"&J108&\"・\"&K108&\"・\"&L108&\"・\"&M108&\"・\"&N108))))))","v":""},"","","","",""]
[null,{"$f":"データリスト!K$46","v":"分会委員長連絡会議"},{"$f":"IF(データリスト!$K47=\"\",\"\",データリスト!$K47)","v":"出欠確認・報告"},{"$nulls":17},{"$f":"IF(I109:N109=\"\",\"\",IF(J109:N109=\"\",I109,IF(K109:N109=\"\",I109&\"・\"&J109,IF(L109:N109=\"\",I109&\"・\"&J109&\"・\"&K109,IF(M109:N109=\"\",I109&\"・\"&J109&\"・\"&K109&\"・\"&L109,IF(N109=\"\",I109&\"・\"&J109&\"・\"&K109&\"・\"&L109&\"・\"&M109,I109&\"・\"&J109&\"・\"&K109&\"・\"&L109&\"・\"&M109&\"・\"&N109))))))","v":""},"","","","",""]
[null,{"$f":"データリスト!K$46","v":"分会委員長連絡会議"},{"$f":"IF(データリスト!$K48=\"\",\"\",データリスト!$K48)","v":"会議出席"},{"$nulls":17},{"$f":"IF(I110:N110=\"\",\"\",IF(J110:N110=\"\",I110,IF(K110:N110=\"\",I110&\"・\"&J110,IF(L110:N110=\"\",I110&\"・\"&J110&\"・\"&K110,IF(M110:N110=\"\",I110&\"・\"&J110&\"・\"&K110&\"・\"&L110,IF(N110=\"\",I110&\"・\"&J110&\"・\"&K110&\"・\"&L110&\"・\"&M110,I110&\"・\"&J110&\"・\"&K110&\"・\"&L110&\"・\"&M110&\"・\"&N110))))))","v":""},"","","","",""]
[null,{"$f":"データリスト!K$46","v":"分会委員長連絡会議"},{"$f":"IF(データリスト!$K49=\"\",\"\",データリスト!$K49)","v":"分会執行委員会(内容周知)"},{"$nulls":17},{"$f":"IF(I111:N111=\"\",\"\",IF(J111:N111=\"\",I111,IF(K111:N111=\"\",I111&\"・\"&J111,IF(L111:N111=\"\",I111&\"・\"&J111&\"・\"&K111,IF(M111:N111=\"\",I111&\"・\"&J111&\"・\"&K111&\"・\"&L111,IF(N111=\"\",I111&\"・\"&J111&\"・\"&K111&\"・\"&L111&\"・\"&M111,I111&\"・\"&J111&\"・\"&K111&\"・\"&L111&\"・\"&M111&\"・\"&N111))))))","v":""},"","","","",""]
[null,{"$f":"データリスト!K$46","v":"分会委員長連絡会議"},{"$f":"IF(データリスト!$K50=\"\",\"\",データリスト!$K50)","v":"職場集会（報告・内容周知）"},{"$nulls":17},{"$f":"IF(I112:N112=\"\",\"\",IF(J112:N112=\"\",I112,IF(K112:N112=\"\",I112&\"・\"&J112,IF(L112:N112=\"\",I112&\"・\"&J112&\"・\"&K112,IF(M112:N112=\"\",I112&\"・\"&J112&\"・\"&K112&\"・\"&L112,IF(N112=\"\",I112&\"・\"&J112&\"・\"&K112&\"・\"&L112&\"・\"&M112,I112&\"・\"&J112&\"・\"&K112&\"・\"&L112&\"・\"&M112&\"・\"&N112))))))","v":""},"","","","",""]
[null,{"$f":"データリスト!K$46","v":"分会委員長連絡会議"},{"$f":"IF(データリスト!$K51=\"\",\"\",データリスト!$K51)","v":""},{"$nulls":17},{"$f":"IF(I113:N113=\"\",\"\",IF(J113:N113=\"\",I113,IF(K113:N113=\"\",I113&\"・\"&J113,IF(L113:N113=\"\",I113&\"・\"&J113&\"・\"&K113,IF(M113:N113=\"\",I113&\"・\"&J113&\"・\"&K113&\"・\"&L113,IF(N113=\"\",I113&\"・\"&J113&\"・\"&K113&\"・\"&L113&\"・\"&M113,I113&\"・\"&J113&\"・\"&K113&\"・\"&L113&\"・\"&M113&\"・\"&N113))))))","v":""},"","","","",""]
[null,{"$f":"データリスト!K$46","v":"分会委員長連絡会議"},{"$f":"IF(データリスト!$K52=\"\",\"\",データリスト!$K52)","v":""},{"$nulls":17},{"$f":"IF(I114:N114=\"\",\"\",IF(J114:N114=\"\",I114,IF(K114:N114=\"\",I114&\"・\"&J114,IF(L114:N114=\"\",I114&\"・\"&J114&\"・\"&K114,IF(M114:N114=\"\",I114&\"・\"&J114&\"・\"&K114&\"・\"&L114,IF(N114=\"\",I114&\"・\"&J114&\"・\"&K114&\"・\"&L114&\"・\"&M114,I114&\"・\"&J114&\"・\"&K114&\"・\"&L114&\"・\"&M114&\"・\"&N114))))))","v":""},"","","","",""]
[null,{"$f":"データリスト!K$46","v":"分会委員長連絡会議"},{"$f":"IF(データリスト!$K53=\"\",\"\",データリスト!$K53)","v":""},{"$nulls":17},{"$f":"IF(I115:N115=\"\",\"\",IF(J115:N115=\"\",I115,IF(K115:N115=\"\",I115&\"・\"&J115,IF(L115:N115=\"\",I115&\"・\"&J115&\"・\"&K115,IF(M115:N115=\"\",I115&\"・\"&J115&\"・\"&K115&\"・\"&L115,IF(N115=\"\",I115&\"・\"&J115&\"・\"&K115&\"・\"&L115&\"・\"&M115,I115&\"・\"&J115&\"・\"&K115&\"・\"&L115&\"・\"&M115&\"・\"&N115))))))","v":""},"","","","",""]
[null,{"$f":"データリスト!K$46","v":"分会委員長連絡会議"},{"$f":"IF(データリスト!$K54=\"\",\"\",データリスト!$K54)","v":""},{"$nulls":17},{"$f":"IF(I116:N116=\"\",\"\",IF(J116:N116=\"\",I116,IF(K116:N116=\"\",I116&\"・\"&J116,IF(L116:N116=\"\",I116&\"・\"&J116&\"・\"&K116,IF(M116:N116=\"\",I116&\"・\"&J116&\"・\"&K116&\"・\"&L116,IF(N116=\"\",I116&\"・\"&J116&\"・\"&K116&\"・\"&L116&\"・\"&M116,I116&\"・\"&J116&\"・\"&K116&\"・\"&L116&\"・\"&M116&\"・\"&N116))))))","v":""},"","","","",""]
[null,{"$f":"データリスト!K$46","v":"分会委員長連絡会議"},{"$f":"IF(データリスト!$K55=\"\",\"\",データリスト!$K55)","v":""},{"$nulls":17},{"$f":"IF(I117:N117=\"\",\"\",IF(J117:N117=\"\",I117,IF(K117:N117=\"\",I117&\"・\"&J117,IF(L117:N117=\"\",I117&\"・\"&J117&\"・\"&K117,IF(M117:N117=\"\",I117&\"・\"&J117&\"・\"&K117&\"・\"&L117,IF(N117=\"\",I117&\"・\"&J117&\"・\"&K117&\"・\"&L117&\"・\"&M117,I117&\"・\"&J117&\"・\"&K117&\"・\"&L117&\"・\"&M117&\"・\"&N117))))))","v":""},"","","","",""]
[null,{"$f":"データリスト!K$46","v":"分会委員長連絡会議"},{"$f":"IF(データリスト!$K56=\"\",\"\",データリスト!$K56)","v":""},{"$nulls":17},{"$f":"IF(I118:N118=\"\",\"\",IF(J118:N118=\"\",I118,IF(K118:N118=\"\",I118&\"・\"&J118,IF(L118:N118=\"\",I118&\"・\"&J118&\"・\"&K118,IF(M118:N118=\"\",I118&\"・\"&J118&\"・\"&K118&\"・\"&L118,IF(N118=\"\",I118&\"・\"&J118&\"・\"&K118&\"・\"&L118&\"・\"&M118,I118&\"・\"&J118&\"・\"&K118&\"・\"&L118&\"・\"&M118&\"・\"&N118))))))","v":""},"","","","",""]
[null,{"$f":"データリスト!K$46","v":"分会委員長連絡会議"},{"$f":"IF(データリスト!$K57=\"\",\"\",データリスト!$K57)","v":""},{"$nulls":17},{"$f":"IF(I119:N119=\"\",\"\",IF(J119:N119=\"\",I119,IF(K119:N119=\"\",I119&\"・\"&J119,IF(L119:N119=\"\",I119&\"・\"&J119&\"・\"&K119,IF(M119:N119=\"\",I119&\"・\"&J119&\"・\"&K119&\"・\"&L119,IF(N119=\"\",I119&\"・\"&J119&\"・\"&K119&\"・\"&L119&\"・\"&M119,I119&\"・\"&J119&\"・\"&K119&\"・\"&L119&\"・\"&M119&\"・\"&N119))))))","v":""},"","","","",""]
[null,{"$f":"データリスト!K$46","v":"分会委員長連絡会議"},{"$f":"IF(データリスト!$K58=\"\",\"\",データリスト!$K58)","v":""},{"$nulls":17},{"$f":"IF(I120:N120=\"\",\"\",IF(J120:N120=\"\",I120,IF(K120:N120=\"\",I120&\"・\"&J120,IF(L120:N120=\"\",I120&\"・\"&J120&\"・\"&K120,IF(M120:N120=\"\",I120&\"・\"&J120&\"・\"&K120&\"・\"&L120,IF(N120=\"\",I120&\"・\"&J120&\"・\"&K120&\"・\"&L120&\"・\"&M120,I120&\"・\"&J120&\"・\"&K120&\"・\"&L120&\"・\"&M120&\"・\"&N120))))))","v":""},"","","","",""]
[null,{"$f":"データリスト!K$46","v":"分会委員長連絡会議"},{"$f":"IF(データリスト!$K59=\"\",\"\",データリスト!$K59)","v":""},{"$nulls":17},{"$f":"IF(I121:N121=\"\",\"\",IF(J121:N121=\"\",I121,IF(K121:N121=\"\",I121&\"・\"&J121,IF(L121:N121=\"\",I121&\"・\"&J121&\"・\"&K121,IF(M121:N121=\"\",I121&\"・\"&J121&\"・\"&K121&\"・\"&L121,IF(N121=\"\",I121&\"・\"&J121&\"・\"&K121&\"・\"&L121&\"・\"&M121,I121&\"・\"&J121&\"・\"&K121&\"・\"&L121&\"・\"&M121&\"・\"&N121))))))","v":""},"","","","",""]
[null,{"$f":"データリスト!K$46","v":"分会委員長連絡会議"},{"$f":"IF(データリスト!$K60=\"\",\"\",データリスト!$K60)","v":""},{"$nulls":17},{"$f":"IF(I122:N122=\"\",\"\",IF(J122:N122=\"\",I122,IF(K122:N122=\"\",I122&\"・\"&J122,IF(L122:N122=\"\",I122&\"・\"&J122&\"・\"&K122,IF(M122:N122=\"\",I122&\"・\"&J122&\"・\"&K122&\"・\"&L122,IF(N122=\"\",I122&\"・\"&J122&\"・\"&K122&\"・\"&L122&\"・\"&M122,I122&\"・\"&J122&\"・\"&K122&\"・\"&L122&\"・\"&M122&\"・\"&N122))))))","v":""},"","","","",""]
[null,{"$f":"データリスト!K$46","v":"分会委員長連絡会議"},{"$f":"IF(データリスト!$K61=\"\",\"\",データリスト!$K61)","v":""},{"$nulls":17},{"$f":"IF(I123:N123=\"\",\"\",IF(J123:N123=\"\",I123,IF(K123:N123=\"\",I123&\"・\"&J123,IF(L123:N123=\"\",I123&\"・\"&J123&\"・\"&K123,IF(M123:N123=\"\",I123&\"・\"&J123&\"・\"&K123&\"・\"&L123,IF(N123=\"\",I123&\"・\"&J123&\"・\"&K123&\"・\"&L123&\"・\"&M123,I123&\"・\"&J123&\"・\"&K123&\"・\"&L123&\"・\"&M123&\"・\"&N123))))))","v":""},"","","","",""]
[null,{"$f":"データリスト!K$46","v":"分会委員長連絡会議"},{"$f":"IF(データリスト!$K62=\"\",\"\",データリスト!$K62)","v":""},{"$nulls":17},{"$f":"IF(I124:N124=\"\",\"\",IF(J124:N124=\"\",I124,IF(K124:N124=\"\",I124&\"・\"&J124,IF(L124:N124=\"\",I124&\"・\"&J124&\"・\"&K124,IF(M124:N124=\"\",I124&\"・\"&J124&\"・\"&K124&\"・\"&L124,IF(N124=\"\",I124&\"・\"&J124&\"・\"&K124&\"・\"&L124&\"・\"&M124,I124&\"・\"&J124&\"・\"&K124&\"・\"&L124&\"・\"&M124&\"・\"&N124))))))","v":""},"","","","",""]
[null,{"$f":"データリスト!K$46","v":"分会委員長連絡会議"},{"$f":"IF(データリスト!$K63=\"\",\"\",データリスト!$K63)","v":""},{"$nulls":17},{"$f":"IF(I125:N125=\"\",\"\",IF(J125:N125=\"\",I125,IF(K125:N125=\"\",I125&\"・\"&J125,IF(L125:N125=\"\",I125&\"・\"&J125&\"・\"&K125,IF(M125:N125=\"\",I125&\"・\"&J125&\"・\"&K125&\"・\"&L125,IF(N125=\"\",I125&\"・\"&J125&\"・\"&K125&\"・\"&L125&\"・\"&M125,I125&\"・\"&J125&\"・\"&K125&\"・\"&L125&\"・\"&M125&\"・\"&N125))))))","v":""},"","","","",""]
[null,{"$f":"データリスト!K$46","v":"分会委員長連絡会議"},{"$f":"IF(データリスト!$K64=\"\",\"\",データリスト!$K64)","v":""},{"$nulls":17},{"$f":"IF(I126:N126=\"\",\"\",IF(J126:N126=\"\",I126,IF(K126:N126=\"\",I126&\"・\"&J126,IF(L126:N126=\"\",I126&\"・\"&J126&\"・\"&K126,IF(M126:N126=\"\",I126&\"・\"&J126&\"・\"&K126&\"・\"&L126,IF(N126=\"\",I126&\"・\"&J126&\"・\"&K126&\"・\"&L126&\"・\"&M126,I126&\"・\"&J126&\"・\"&K126&\"・\"&L126&\"・\"&M126&\"・\"&N126))))))","v":""},"","","","",""]
[null,{"$f":"データリスト!K$46","v":"分会委員長連絡会議"},{"$f":"IF(データリスト!$K65=\"\",\"\",データリスト!$K65)","v":""},{"$nulls":17},{"$f":"IF(I127:N127=\"\",\"\",IF(J127:N127=\"\",I127,IF(K127:N127=\"\",I127&\"・\"&J127,IF(L127:N127=\"\",I127&\"・\"&J127&\"・\"&K127,IF(M127:N127=\"\",I127&\"・\"&J127&\"・\"&K127&\"・\"&L127,IF(N127=\"\",I127&\"・\"&J127&\"・\"&K127&\"・\"&L127&\"・\"&M127,I127&\"・\"&J127&\"・\"&K127&\"・\"&L127&\"・\"&M127&\"・\"&N127))))))","v":""},"","","","",""]
[null,{"$f":"データリスト!K$46","v":"分会委員長連絡会議"},{"$f":"IF(データリスト!$K66=\"\",\"\",データリスト!$K66)","v":""},{"$nulls":17},{"$f":"IF(I128:N128=\"\",\"\",IF(J128:N128=\"\",I128,IF(K128:N128=\"\",I128&\"・\"&J128,IF(L128:N128=\"\",I128&\"・\"&J128&\"・\"&K128,IF(M128:N128=\"\",I128&\"・\"&J128&\"・\"&K128&\"・\"&L128,IF(N128=\"\",I128&\"・\"&J128&\"・\"&K128&\"・\"&L128&\"・\"&M128,I128&\"・\"&J128&\"・\"&K128&\"・\"&L128&\"・\"&M128&\"・\"&N128))))))","v":""},"","","","",""]
[null,{"$f":"データリスト!L$46","v":"総合生活改善交渉"},{"$f":"IF(データリスト!$L47=\"\",\"\",データリスト!$L47)","v":"開催周知"},{"$nulls":17},{"$f":"IF(I129:N129=\"\",\"\",IF(J129:N129=\"\",I129,IF(K129:N129=\"\",I129&\"・\"&J129,IF(L129:N129=\"\",I129&\"・\"&J129&\"・\"&K129,IF(M129:N129=\"\",I129&\"・\"&J129&\"・\"&K129&\"・\"&L129,IF(N129=\"\",I129&\"・\"&J129&\"・\"&K129&\"・\"&L129&\"・\"&M129,I129&\"・\"&J129&\"・\"&K129&\"・\"&L129&\"・\"&M129&\"・\"&N129))))))","v":""},"","","","",""]
[null,{"$f":"データリスト!L$46","v":"総合生活改善交渉"},{"$f":"IF(データリスト!$L48=\"\",\"\",データリスト!$L48)","v":"職場オルグ準備"},{"$nulls":17},{"$f":"IF(I130:N130=\"\",\"\",IF(J130:N130=\"\",I130,IF(K130:N130=\"\",I130&\"・\"&J130,IF(L130:N130=\"\",I130&\"・\"&J130&\"・\"&K130,IF(M130:N130=\"\",I130&\"・\"&J130&\"・\"&K130&\"・\"&L130,IF(N130=\"\",I130&\"・\"&J130&\"・\"&K130&\"・\"&L130&\"・\"&M130,I130&\"・\"&J130&\"・\"&K130&\"・\"&L130&\"・\"&M130&\"・\"&N130))))))","v":""},"","","","",""]
[null,{"$f":"データリスト!L$46","v":"総合生活改善交渉"},{"$f":"IF(データリスト!$L49=\"\",\"\",データリスト!$L49)","v":"オルグの開催"},{"$nulls":17},{"$f":"IF(I131:N131=\"\",\"\",IF(J131:N131=\"\",I131,IF(K131:N131=\"\",I131&\"・\"&J131,IF(L131:N131=\"\",I131&\"・\"&J131&\"・\"&K131,IF(M131:N131=\"\",I131&\"・\"&J131&\"・\"&K131&\"・\"&L131,IF(N131=\"\",I131&\"・\"&J131&\"・\"&K131&\"・\"&L131&\"・\"&M131,I131&\"・\"&J131&\"・\"&K131&\"・\"&L131&\"・\"&M131&\"・\"&N131))))))","v":""},"","","","",""]
[null,{"$f":"データリスト!L$46","v":"総合生活改善交渉"},{"$f":"IF(データリスト!$L50=\"\",\"\",データリスト!$L50)","v":"意見集約"},{"$nulls":17},{"$f":"IF(I132:N132=\"\",\"\",IF(J132:N132=\"\",I132,IF(K132:N132=\"\",I132&\"・\"&J132,IF(L132:N132=\"\",I132&\"・\"&J132&\"・\"&K132,IF(M132:N132=\"\",I132&\"・\"&J132&\"・\"&K132&\"・\"&L132,IF(N132=\"\",I132&\"・\"&J132&\"・\"&K132&\"・\"&L132&\"・\"&M132,I132&\"・\"&J132&\"・\"&K132&\"・\"&L132&\"・\"&M132&\"・\"&N132))))))","v":""},"","","","",""]
[null,{"$f":"データリスト!L$46","v":"総合生活改善交渉"},{"$f":"IF(データリスト!$L51=\"\",\"\",データリスト!$L51)","v":"スト権批准投票"},{"$nulls":17},{"$f":"IF(I133:N133=\"\",\"\",IF(J133:N133=\"\",I133,IF(K133:N133=\"\",I133&\"・\"&J133,IF(L133:N133=\"\",I133&\"・\"&J133&\"・\"&K133,IF(M133:N133=\"\",I133&\"・\"&J133&\"・\"&K133&\"・\"&L133,IF(N133=\"\",I133&\"・\"&J133&\"・\"&K133&\"・\"&L133&\"・\"&M133,I133&\"・\"&J133&\"・\"&K133&\"・\"&L133&\"・\"&M133&\"・\"&N133))))))","v":""},"","","","",""]
[null,{"$f":"データリスト!L$46","v":"総合生活改善交渉"},{"$f":"IF(データリスト!$L52=\"\",\"\",データリスト!$L52)","v":"スト権報告"},{"$nulls":17},{"$f":"IF(I134:N134=\"\",\"\",IF(J134:N134=\"\",I134,IF(K134:N134=\"\",I134&\"・\"&J134,IF(L134:N134=\"\",I134&\"・\"&J134&\"・\"&K134,IF(M134:N134=\"\",I134&\"・\"&J134&\"・\"&K134&\"・\"&L134,IF(N134=\"\",I134&\"・\"&J134&\"・\"&K134&\"・\"&L134&\"・\"&M134,I134&\"・\"&J134&\"・\"&K134&\"・\"&L134&\"・\"&M134&\"・\"&N134))))))","v":""},"","","","",""]
[null,{"$f":"データリスト!L$46","v":"総合生活改善交渉"},{"$f":"IF(データリスト!$L53=\"\",\"\",データリスト!$L53)","v":"地区交渉推進会議"},{"$nulls":17},{"$f":"IF(I135:N135=\"\",\"\",IF(J135:N135=\"\",I135,IF(K135:N135=\"\",I135&\"・\"&J135,IF(L135:N135=\"\",I135&\"・\"&J135&\"・\"&K135,IF(M135:N135=\"\",I135&\"・\"&J135&\"・\"&K135&\"・\"&L135,IF(N135=\"\",I135&\"・\"&J135&\"・\"&K135&\"・\"&L135&\"・\"&M135,I135&\"・\"&J135&\"・\"&K135&\"・\"&L135&\"・\"&M135&\"・\"&N135))))))","v":""},"","","","",""]
[null,{"$f":"データリスト!L$46","v":"総合生活改善交渉"},{"$f":"IF(データリスト!$L54=\"\",\"\",データリスト!$L54)","v":"分会執行委員会(内容周知)"},{"$nulls":17},{"$f":"IF(I136:N136=\"\",\"\",IF(J136:N136=\"\",I136,IF(K136:N136=\"\",I136&\"・\"&J136,IF(L136:N136=\"\",I136&\"・\"&J136&\"・\"&K136,IF(M136:N136=\"\",I136&\"・\"&J136&\"・\"&K136&\"・\"&L136,IF(N136=\"\",I136&\"・\"&J136&\"・\"&K136&\"・\"&L136&\"・\"&M136,I136&\"・\"&J136&\"・\"&K136&\"・\"&L136&\"・\"&M136&\"・\"&N136))))))","v":""},"","","","",""]
[null,{"$f":"データリスト!L$46","v":"総合生活改善交渉"},{"$f":"IF(データリスト!$L55=\"\",\"\",データリスト!$L55)","v":"職場集会(内容周知)"},{"$nulls":17},{"$f":"IF(I137:N137=\"\",\"\",IF(J137:N137=\"\",I137,IF(K137:N137=\"\",I137&\"・\"&J137,IF(L137:N137=\"\",I137&\"・\"&J137&\"・\"&K137,IF(M137:N137=\"\",I137&\"・\"&J137&\"・\"&K137&\"・\"&L137,IF(N137=\"\",I137&\"・\"&J137&\"・\"&K137&\"・\"&L137&\"・\"&M137,I137&\"・\"&J137&\"・\"&K137&\"・\"&L137&\"・\"&M137&\"・\"&N137))))))","v":""},"","","","",""]
[null,{"$f":"データリスト!L$46","v":"総合生活改善交渉"},{"$f":"IF(データリスト!$L56=\"\",\"\",データリスト!$L56)","v":""},{"$nulls":17},{"$f":"IF(I138:N138=\"\",\"\",IF(J138:N138=\"\",I138,IF(K138:N138=\"\",I138&\"・\"&J138,IF(L138:N138=\"\",I138&\"・\"&J138&\"・\"&K138,IF(M138:N138=\"\",I138&\"・\"&J138&\"・\"&K138&\"・\"&L138,IF(N138=\"\",I138&\"・\"&J138&\"・\"&K138&\"・\"&L138&\"・\"&M138,I138&\"・\"&J138&\"・\"&K138&\"・\"&L138&\"・\"&M138&\"・\"&N138))))))","v":""},"","","","",""]
[null,{"$f":"データリスト!L$46","v":"総合生活改善交渉"},{"$f":"IF(データリスト!$L57=\"\",\"\",データリスト!$L57)","v":""},{"$nulls":17},{"$f":"IF(I139:N139=\"\",\"\",IF(J139:N139=\"\",I139,IF(K139:N139=\"\",I139&\"・\"&J139,IF(L139:N139=\"\",I139&\"・\"&J139&\"・\"&K139,IF(M139:N139=\"\",I139&\"・\"&J139&\"・\"&K139&\"・\"&L139,IF(N139=\"\",I139&\"・\"&J139&\"・\"&K139&\"・\"&L139&\"・\"&M139,I139&\"・\"&J139&\"・\"&K139&\"・\"&L139&\"・\"&M139&\"・\"&N139))))))","v":""},"","","","",""]
[null,{"$f":"データリスト!L$46","v":"総合生活改善交渉"},{"$f":"IF(データリスト!$L58=\"\",\"\",データリスト!$L58)","v":""},{"$nulls":17},{"$f":"IF(I140:N140=\"\",\"\",IF(J140:N140=\"\",I140,IF(K140:N140=\"\",I140&\"・\"&J140,IF(L140:N140=\"\",I140&\"・\"&J140&\"・\"&K140,IF(M140:N140=\"\",I140&\"・\"&J140&\"・\"&K140&\"・\"&L140,IF(N140=\"\",I140&\"・\"&J140&\"・\"&K140&\"・\"&L140&\"・\"&M140,I140&\"・\"&J140&\"・\"&K140&\"・\"&L140&\"・\"&M140&\"・\"&N140))))))","v":""},"","","","",""]
[null,{"$f":"データリスト!L$46","v":"総合生活改善交渉"},{"$f":"IF(データリスト!$L59=\"\",\"\",データリスト!$L59)","v":""},{"$nulls":17},{"$f":"IF(I141:N141=\"\",\"\",IF(J141:N141=\"\",I141,IF(K141:N141=\"\",I141&\"・\"&J141,IF(L141:N141=\"\",I141&\"・\"&J141&\"・\"&K141,IF(M141:N141=\"\",I141&\"・\"&J141&\"・\"&K141&\"・\"&L141,IF(N141=\"\",I141&\"・\"&J141&\"・\"&K141&\"・\"&L141&\"・\"&M141,I141&\"・\"&J141&\"・\"&K141&\"・\"&L141&\"・\"&M141&\"・\"&N141))))))","v":""},"","","","",""]
[null,{"$f":"データリスト!L$46","v":"総合生活改善交渉"},{"$f":"IF(データリスト!$L60=\"\",\"\",データリスト!$L60)","v":""},{"$nulls":17},{"$f":"IF(I142:N142=\"\",\"\",IF(J142:N142=\"\",I142,IF(K142:N142=\"\",I142&\"・\"&J142,IF(L142:N142=\"\",I142&\"・\"&J142&\"・\"&K142,IF(M142:N142=\"\",I142&\"・\"&J142&\"・\"&K142&\"・\"&L142,IF(N142=\"\",I142&\"・\"&J142&\"・\"&K142&\"・\"&L142&\"・\"&M142,I142&\"・\"&J142&\"・\"&K142&\"・\"&L142&\"・\"&M142&\"・\"&N142))))))","v":""},"","","","",""]
[null,{"$f":"データリスト!L$46","v":"総合生活改善交渉"},{"$f":"IF(データリスト!$L61=\"\",\"\",データリスト!$L61)","v":""},{"$nulls":17},{"$f":"IF(I143:N143=\"\",\"\",IF(J143:N143=\"\",I143,IF(K143:N143=\"\",I143&\"・\"&J143,IF(L143:N143=\"\",I143&\"・\"&J143&\"・\"&K143,IF(M143:N143=\"\",I143&\"・\"&J143&\"・\"&K143&\"・\"&L143,IF(N143=\"\",I143&\"・\"&J143&\"・\"&K143&\"・\"&L143&\"・\"&M143,I143&\"・\"&J143&\"・\"&K143&\"・\"&L143&\"・\"&M143&\"・\"&N143))))))","v":""},"","","","",""]
[null,{"$f":"データリスト!L$46","v":"総合生活改善交渉"},{"$f":"IF(データリスト!$L62=\"\",\"\",データリスト!$L62)","v":""},{"$nulls":17},{"$f":"IF(I144:N144=\"\",\"\",IF(J144:N144=\"\",I144,IF(K144:N144=\"\",I144&\"・\"&J144,IF(L144:N144=\"\",I144&\"・\"&J144&\"・\"&K144,IF(M144:N144=\"\",I144&\"・\"&J144&\"・\"&K144&\"・\"&L144,IF(N144=\"\",I144&\"・\"&J144&\"・\"&K144&\"・\"&L144&\"・\"&M144,I144&\"・\"&J144&\"・\"&K144&\"・\"&L144&\"・\"&M144&\"・\"&N144))))))","v":""},"","","","",""]
[null,{"$f":"データリスト!L$46","v":"総合生活改善交渉"},{"$f":"IF(データリスト!$L63=\"\",\"\",データリスト!$L63)","v":""},{"$nulls":17},{"$f":"IF(I145:N145=\"\",\"\",IF(J145:N145=\"\",I145,IF(K145:N145=\"\",I145&\"・\"&J145,IF(L145:N145=\"\",I145&\"・\"&J145&\"・\"&K145,IF(M145:N145=\"\",I145&\"・\"&J145&\"・\"&K145&\"・\"&L145,IF(N145=\"\",I145&\"・\"&J145&\"・\"&K145&\"・\"&L145&\"・\"&M145,I145&\"・\"&J145&\"・\"&K145&\"・\"&L145&\"・\"&M145&\"・\"&N145))))))","v":""},"","","","",""]
[null,{"$f":"データリスト!L$46","v":"総合生活改善交渉"},{"$f":"IF(データリスト!$L64=\"\",\"\",データリスト!$L64)","v":""},{"$nulls":17},{"$f":"IF(I146:N146=\"\",\"\",IF(J146:N146=\"\",I146,IF(K146:N146=\"\",I146&\"・\"&J146,IF(L146:N146=\"\",I146&\"・\"&J146&\"・\"&K146,IF(M146:N146=\"\",I146&\"・\"&J146&\"・\"&K146&\"・\"&L146,IF(N146=\"\",I146&\"・\"&J146&\"・\"&K146&\"・\"&L146&\"・\"&M146,I146&\"・\"&J146&\"・\"&K146&\"・\"&L146&\"・\"&M146&\"・\"&N146))))))","v":""},"","","","",""]
[null,{"$f":"データリスト!L$46","v":"総合生活改善交渉"},{"$f":"IF(データリスト!$L65=\"\",\"\",データリスト!$L65)","v":""},{"$nulls":17},{"$f":"IF(I147:N147=\"\",\"\",IF(J147:N147=\"\",I147,IF(K147:N147=\"\",I147&\"・\"&J147,IF(L147:N147=\"\",I147&\"・\"&J147&\"・\"&K147,IF(M147:N147=\"\",I147&\"・\"&J147&\"・\"&K147&\"・\"&L147,IF(N147=\"\",I147&\"・\"&J147&\"・\"&K147&\"・\"&L147&\"・\"&M147,I147&\"・\"&J147&\"・\"&K147&\"・\"&L147&\"・\"&M147&\"・\"&N147))))))","v":""},"","","","",""]
[null,{"$f":"データリスト!L$46","v":"総合生活改善交渉"},{"$f":"IF(データリスト!$L66=\"\",\"\",データリスト!$L66)","v":""},{"$nulls":17},{"$f":"IF(I148:N148=\"\",\"\",IF(J148:N148=\"\",I148,IF(K148:N148=\"\",I148&\"・\"&J148,IF(L148:N148=\"\",I148&\"・\"&J148&\"・\"&K148,IF(M148:N148=\"\",I148&\"・\"&J148&\"・\"&K148&\"・\"&L148,IF(N148=\"\",I148&\"・\"&J148&\"・\"&K148&\"・\"&L148&\"・\"&M148,I148&\"・\"&J148&\"・\"&K148&\"・\"&L148&\"・\"&M148&\"・\"&N148))))))","v":""},"","","","",""]
[null,{"$f":"データリスト!M$46","v":"支部青年委員会総会"},{"$f":"IF(データリスト!$M47=\"\",\"\",データリスト!$M47)","v":"計画・日程調整"},{"$nulls":17},{"$f":"IF(I149:N149=\"\",\"\",IF(J149:N149=\"\",I149,IF(K149:N149=\"\",I149&\"・\"&J149,IF(L149:N149=\"\",I149&\"・\"&J149&\"・\"&K149,IF(M149:N149=\"\",I149&\"・\"&J149&\"・\"&K149&\"・\"&L149,IF(N149=\"\",I149&\"・\"&J149&\"・\"&K149&\"・\"&L149&\"・\"&M149,I149&\"・\"&J149&\"・\"&K149&\"・\"&L149&\"・\"&M149&\"・\"&N149))))))","v":""},"","","","",""]
[null,{"$f":"データリスト!M$46","v":"支部青年委員会総会"},{"$f":"IF(データリスト!$M48=\"\",\"\",データリスト!$M48)","v":"開催周知"},{"$nulls":17},{"$f":"IF(I150:N150=\"\",\"\",IF(J150:N150=\"\",I150,IF(K150:N150=\"\",I150&\"・\"&J150,IF(L150:N150=\"\",I150&\"・\"&J150&\"・\"&K150,IF(M150:N150=\"\",I150&\"・\"&J150&\"・\"&K150&\"・\"&L150,IF(N150=\"\",I150&\"・\"&J150&\"・\"&K150&\"・\"&L150&\"・\"&M150,I150&\"・\"&J150&\"・\"&K150&\"・\"&L150&\"・\"&M150&\"・\"&N150))))))","v":""},"","","","",""]
[null,{"$f":"データリスト!M$46","v":"支部青年委員会総会"},{"$f":"IF(データリスト!$M49=\"\",\"\",データリスト!$M49)","v":"事前準備(資料作成)"},{"$nulls":17},{"$f":"IF(I151:N151=\"\",\"\",IF(J151:N151=\"\",I151,IF(K151:N151=\"\",I151&\"・\"&J151,IF(L151:N151=\"\",I151&\"・\"&J151&\"・\"&K151,IF(M151:N151=\"\",I151&\"・\"&J151&\"・\"&K151&\"・\"&L151,IF(N151=\"\",I151&\"・\"&J151&\"・\"&K151&\"・\"&L151&\"・\"&M151,I151&\"・\"&J151&\"・\"&K151&\"・\"&L151&\"・\"&M151&\"・\"&N151))))))","v":""},"","","","",""]
[null,{"$f":"データリスト!M$46","v":"支部青年委員会総会"},{"$f":"IF(データリスト!$M50=\"\",\"\",データリスト!$M50)","v":"議長・進行"},{"$nulls":17},{"$f":"IF(I152:N152=\"\",\"\",IF(J152:N152=\"\",I152,IF(K152:N152=\"\",I152&\"・\"&J152,IF(L152:N152=\"\",I152&\"・\"&J152&\"・\"&K152,IF(M152:N152=\"\",I152&\"・\"&J152&\"・\"&K152&\"・\"&L152,IF(N152=\"\",I152&\"・\"&J152&\"・\"&K152&\"・\"&L152&\"・\"&M152,I152&\"・\"&J152&\"・\"&K152&\"・\"&L152&\"・\"&M152&\"・\"&N152))))))","v":""},"","","","",""]
[null,{"$f":"データリスト!M$46","v":"支部青年委員会総会"},{"$f":"IF(データリスト!$M51=\"\",\"\",データリスト!$M51)","v":"確認事項周知"},{"$nulls":17},{"$f":"IF(I153:N153=\"\",\"\",IF(J153:N153=\"\",I153,IF(K153:N153=\"\",I153&\"・\"&J153,IF(L153:N153=\"\",I153&\"・\"&J153&\"・\"&K153,IF(M153:N153=\"\",I153&\"・\"&J153&\"・\"&K153&\"・\"&L153,IF(N153=\"\",I153&\"・\"&J153&\"・\"&K153&\"・\"&L153&\"・\"&M153,I153&\"・\"&J153&\"・\"&K153&\"・\"&L153&\"・\"&M153&\"・\"&N153))))))","v":""},"","","","",""]
[null,{"$f":"データリスト!M$46","v":"支部青年委員会総会"},{"$f":"IF(データリスト!$M52=\"\",\"\",データリスト!$M52)","v":"報告（支部・本部へ報告）"},{"$nulls":17},{"$f":"IF(I154:N154=\"\",\"\",IF(J154:N154=\"\",I154,IF(K154:N154=\"\",I154&\"・\"&J154,IF(L154:N154=\"\",I154&\"・\"&J154&\"・\"&K154,IF(M154:N154=\"\",I154&\"・\"&J154&\"・\"&K154&\"・\"&L154,IF(N154=\"\",I154&\"・\"&J154&\"・\"&K154&\"・\"&L154&\"・\"&M154,I154&\"・\"&J154&\"・\"&K154&\"・\"&L154&\"・\"&M154&\"・\"&N154))))))","v":""},"","","","",""]
[null,{"$f":"データリスト!M$46","v":"支部青年委員会総会"},{"$f":"IF(データリスト!$M53=\"\",\"\",データリスト!$M53)","v":""},{"$nulls":17},{"$f":"IF(I155:N155=\"\",\"\",IF(J155:N155=\"\",I155,IF(K155:N155=\"\",I155&\"・\"&J155,IF(L155:N155=\"\",I155&\"・\"&J155&\"・\"&K155,IF(M155:N155=\"\",I155&\"・\"&J155&\"・\"&K155&\"・\"&L155,IF(N155=\"\",I155&\"・\"&J155&\"・\"&K155&\"・\"&L155&\"・\"&M155,I155&\"・\"&J155&\"・\"&K155&\"・\"&L155&\"・\"&M155&\"・\"&N155))))))","v":""},"","","","",""]
[null,{"$f":"データリスト!M$46","v":"支部青年委員会総会"},{"$f":"IF(データリスト!$M54=\"\",\"\",データリスト!$M54)","v":""},{"$nulls":17},{"$f":"IF(I156:N156=\"\",\"\",IF(J156:N156=\"\",I156,IF(K156:N156=\"\",I156&\"・\"&J156,IF(L156:N156=\"\",I156&\"・\"&J156&\"・\"&K156,IF(M156:N156=\"\",I156&\"・\"&J156&\"・\"&K156&\"・\"&L156,IF(N156=\"\",I156&\"・\"&J156&\"・\"&K156&\"・\"&L156&\"・\"&M156,I156&\"・\"&J156&\"・\"&K156&\"・\"&L156&\"・\"&M156&\"・\"&N156))))))","v":""},"","","","",""]
[null,{"$f":"データリスト!M$46","v":"支部青年委員会総会"},{"$f":"IF(データリスト!$M55=\"\",\"\",データリスト!$M55)","v":""},{"$nulls":17},{"$f":"IF(I157:N157=\"\",\"\",IF(J157:N157=\"\",I157,IF(K157:N157=\"\",I157&\"・\"&J157,IF(L157:N157=\"\",I157&\"・\"&J157&\"・\"&K157,IF(M157:N157=\"\",I157&\"・\"&J157&\"・\"&K157&\"・\"&L157,IF(N157=\"\",I157&\"・\"&J157&\"・\"&K157&\"・\"&L157&\"・\"&M157,I157&\"・\"&J157&\"・\"&K157&\"・\"&L157&\"・\"&M157&\"・\"&N157))))))","v":""},"","","","",""]
[null,{"$f":"データリスト!M$46","v":"支部青年委員会総会"},{"$f":"IF(データリスト!$M56=\"\",\"\",データリスト!$M56)","v":""},{"$nulls":17},{"$f":"IF(I158:N158=\"\",\"\",IF(J158:N158=\"\",I158,IF(K158:N158=\"\",I158&\"・\"&J158,IF(L158:N158=\"\",I158&\"・\"&J158&\"・\"&K158,IF(M158:N158=\"\",I158&\"・\"&J158&\"・\"&K158&\"・\"&L158,IF(N158=\"\",I158&\"・\"&J158&\"・\"&K158&\"・\"&L158&\"・\"&M158,I158&\"・\"&J158&\"・\"&K158&\"・\"&L158&\"・\"&M158&\"・\"&N158))))))","v":""},"","","","",""]
[null,{"$f":"データリスト!M$46","v":"支部青年委員会総会"},{"$f":"IF(データリスト!$M57=\"\",\"\",データリスト!$M57)","v":""},{"$nulls":17},{"$f":"IF(I159:N159=\"\",\"\",IF(J159:N159=\"\",I159,IF(K159:N159=\"\",I159&\"・\"&J159,IF(L159:N159=\"\",I159&\"・\"&J159&\"・\"&K159,IF(M159:N159=\"\",I159&\"・\"&J159&\"・\"&K159&\"・\"&L159,IF(N159=\"\",I159&\"・\"&J159&\"・\"&K159&\"・\"&L159&\"・\"&M159,I159&\"・\"&J159&\"・\"&K159&\"・\"&L159&\"・\"&M159&\"・\"&N159))))))","v":""},"","","","",""]
[null,{"$f":"データリスト!M$46","v":"支部青年委員会総会"},{"$f":"IF(データリスト!$M58=\"\",\"\",データリスト!$M58)","v":""},{"$nulls":17},{"$f":"IF(I160:N160=\"\",\"\",IF(J160:N160=\"\",I160,IF(K160:N160=\"\",I160&\"・\"&J160,IF(L160:N160=\"\",I160&\"・\"&J160&\"・\"&K160,IF(M160:N160=\"\",I160&\"・\"&J160&\"・\"&K160&\"・\"&L160,IF(N160=\"\",I160&\"・\"&J160&\"・\"&K160&\"・\"&L160&\"・\"&M160,I160&\"・\"&J160&\"・\"&K160&\"・\"&L160&\"・\"&M160&\"・\"&N160))))))","v":""},"","","","",""]
[null,{"$f":"データリスト!M$46","v":"支部青年委員会総会"},{"$f":"IF(データリスト!$M59=\"\",\"\",データリスト!$M59)","v":""},{"$nulls":17},{"$f":"IF(I161:N161=\"\",\"\",IF(J161:N161=\"\",I161,IF(K161:N161=\"\",I161&\"・\"&J161,IF(L161:N161=\"\",I161&\"・\"&J161&\"・\"&K161,IF(M161:N161=\"\",I161&\"・\"&J161&\"・\"&K161&\"・\"&L161,IF(N161=\"\",I161&\"・\"&J161&\"・\"&K161&\"・\"&L161&\"・\"&M161,I161&\"・\"&J161&\"・\"&K161&\"・\"&L161&\"・\"&M161&\"・\"&N161))))))","v":""},"","","","",""]
[null,{"$f":"データリスト!M$46","v":"支部青年委員会総会"},{"$f":"IF(データリスト!$M60=\"\",\"\",データリスト!$M60)","v":""},{"$nulls":17},{"$f":"IF(I162:N162=\"\",\"\",IF(J162:N162=\"\",I162,IF(K162:N162=\"\",I162&\"・\"&J162,IF(L162:N162=\"\",I162&\"・\"&J162&\"・\"&K162,IF(M162:N162=\"\",I162&\"・\"&J162&\"・\"&K162&\"・\"&L162,IF(N162=\"\",I162&\"・\"&J162&\"・\"&K162&\"・\"&L162&\"・\"&M162,I162&\"・\"&J162&\"・\"&K162&\"・\"&L162&\"・\"&M162&\"・\"&N162))))))","v":""},"","","","",""]
[null,{"$f":"データリスト!M$46","v":"支部青年委員会総会"},{"$f":"IF(データリスト!$M61=\"\",\"\",データリスト!$M61)","v":""},{"$nulls":17},{"$f":"IF(I163:N163=\"\",\"\",IF(J163:N163=\"\",I163,IF(K163:N163=\"\",I163&\"・\"&J163,IF(L163:N163=\"\",I163&\"・\"&J163&\"・\"&K163,IF(M163:N163=\"\",I163&\"・\"&J163&\"・\"&K163&\"・\"&L163,IF(N163=\"\",I163&\"・\"&J163&\"・\"&K163&\"・\"&L163&\"・\"&M163,I163&\"・\"&J163&\"・\"&K163&\"・\"&L163&\"・\"&M163&\"・\"&N163))))))","v":""},"","","","",""]
[null,{"$f":"データリスト!M$46","v":"支部青年委員会総会"},{"$f":"IF(データリスト!$M62=\"\",\"\",データリスト!$M62)","v":""},{"$nulls":17},{"$f":"IF(I164:N164=\"\",\"\",IF(J164:N164=\"\",I164,IF(K164:N164=\"\",I164&\"・\"&J164,IF(L164:N164=\"\",I164&\"・\"&J164&\"・\"&K164,IF(M164:N164=\"\",I164&\"・\"&J164&\"・\"&K164&\"・\"&L164,IF(N164=\"\",I164&\"・\"&J164&\"・\"&K164&\"・\"&L164&\"・\"&M164,I164&\"・\"&J164&\"・\"&K164&\"・\"&L164&\"・\"&M164&\"・\"&N164))))))","v":""},"","","","",""]
[null,{"$f":"データリスト!M$46","v":"支部青年委員会総会"},{"$f":"IF(データリスト!$M63=\"\",\"\",データリスト!$M63)","v":""},{"$nulls":17},{"$f":"IF(I165:N165=\"\",\"\",IF(J165:N165=\"\",I165,IF(K165:N165=\"\",I165&\"・\"&J165,IF(L165:N165=\"\",I165&\"・\"&J165&\"・\"&K165,IF(M165:N165=\"\",I165&\"・\"&J165&\"・\"&K165&\"・\"&L165,IF(N165=\"\",I165&\"・\"&J165&\"・\"&K165&\"・\"&L165&\"・\"&M165,I165&\"・\"&J165&\"・\"&K165&\"・\"&L165&\"・\"&M165&\"・\"&N165))))))","v":""},"","","","",""]
[null,{"$f":"データリスト!M$46","v":"支部青年委員会総会"},{"$f":"IF(データリスト!$M64=\"\",\"\",データリスト!$M64)","v":""},{"$nulls":17},{"$f":"IF(I166:N166=\"\",\"\",IF(J166:N166=\"\",I166,IF(K166:N166=\"\",I166&\"・\"&J166,IF(L166:N166=\"\",I166&\"・\"&J166&\"・\"&K166,IF(M166:N166=\"\",I166&\"・\"&J166&\"・\"&K166&\"・\"&L166,IF(N166=\"\",I166&\"・\"&J166&\"・\"&K166&\"・\"&L166&\"・\"&M166,I166&\"・\"&J166&\"・\"&K166&\"・\"&L166&\"・\"&M166&\"・\"&N166))))))","v":""},"","","","",""]
[null,{"$f":"データリスト!M$46","v":"支部青年委員会総会"},{"$f":"IF(データリスト!$M65=\"\",\"\",データリスト!$M65)","v":""},{"$nulls":17},{"$f":"IF(I167:N167=\"\",\"\",IF(J167:N167=\"\",I167,IF(K167:N167=\"\",I167&\"・\"&J167,IF(L167:N167=\"\",I167&\"・\"&J167&\"・\"&K167,IF(M167:N167=\"\",I167&\"・\"&J167&\"・\"&K167&\"・\"&L167,IF(N167=\"\",I167&\"・\"&J167&\"・\"&K167&\"・\"&L167&\"・\"&M167,I167&\"・\"&J167&\"・\"&K167&\"・\"&L167&\"・\"&M167&\"・\"&N167))))))","v":""},"","","","",""]
[null,{"$f":"データリスト!M$46","v":"支部青年委員会総会"},{"$f":"IF(データリスト!$M66=\"\",\"\",データリスト!$M66)","v":""},{"$nulls":17},{"$f":"IF(I168:N168=\"\",\"\",IF(J168:N168=\"\",I168,IF(K168:N168=\"\",I168&\"・\"&J168,IF(L168:N168=\"\",I168&\"・\"&J168&\"・\"&K168,IF(M168:N168=\"\",I168&\"・\"&J168&\"・\"&K168&\"・\"&L168,IF(N168=\"\",I168&\"・\"&J168&\"・\"&K168&\"・\"&L168&\"・\"&M168,I168&\"・\"&J168&\"・\"&K168&\"・\"&L168&\"・\"&M168&\"・\"&N168))))))","v":""},"","","","",""]
[null,{"$f":"データリスト!N$46","v":"支部・各種委員会・協議会"},{"$f":"IF(データリスト!$N47=\"\",\"\",データリスト!$N47)","v":"支社・支部労使協議会"},{"$nulls":17},{"$f":"IF(I169:N169=\"\",\"\",IF(J169:N169=\"\",I169,IF(K169:N169=\"\",I169&\"・\"&J169,IF(L169:N169=\"\",I169&\"・\"&J169&\"・\"&K169,IF(M169:N169=\"\",I169&\"・\"&J169&\"・\"&K169&\"・\"&L169,IF(N169=\"\",I169&\"・\"&J169&\"・\"&K169&\"・\"&L169&\"・\"&M169,I169&\"・\"&J169&\"・\"&K169&\"・\"&L169&\"・\"&M169&\"・\"&N169))))))","v":""},"","","","",""]
[null,{"$f":"データリスト!N$46","v":"支部・各種委員会・協議会"},{"$f":"IF(データリスト!$N48=\"\",\"\",データリスト!$N48)","v":"支社・支部安全衛生委員会協議会"},{"$nulls":17},{"$f":"IF(I170:N170=\"\",\"\",IF(J170:N170=\"\",I170,IF(K170:N170=\"\",I170&\"・\"&J170,IF(L170:N170=\"\",I170&\"・\"&J170&\"・\"&K170,IF(M170:N170=\"\",I170&\"・\"&J170&\"・\"&K170&\"・\"&L170,IF(N170=\"\",I170&\"・\"&J170&\"・\"&K170&\"・\"&L170&\"・\"&M170,I170&\"・\"&J170&\"・\"&K170&\"・\"&L170&\"・\"&M170&\"・\"&N170))))))","v":""},"","","","",""]
[null,{"$f":"データリスト!N$46","v":"支部・各種委員会・協議会"},{"$f":"IF(データリスト!$N49=\"\",\"\",データリスト!$N49)","v":"WLB支社委員会"},{"$nulls":17},{"$f":"IF(I171:N171=\"\",\"\",IF(J171:N171=\"\",I171,IF(K171:N171=\"\",I171&\"・\"&J171,IF(L171:N171=\"\",I171&\"・\"&J171&\"・\"&K171,IF(M171:N171=\"\",I171&\"・\"&J171&\"・\"&K171&\"・\"&L171,IF(N171=\"\",I171&\"・\"&J171&\"・\"&K171&\"・\"&L171&\"・\"&M171,I171&\"・\"&J171&\"・\"&K171&\"・\"&L171&\"・\"&M171&\"・\"&N171))))))","v":""},"","","","",""]
[null,{"$f":"データリスト!N$46","v":"支部・各種委員会・協議会"},{"$f":"IF(データリスト!$N50=\"\",\"\",データリスト!$N50)","v":""},{"$nulls":17},{"$f":"IF(I172:N172=\"\",\"\",IF(J172:N172=\"\",I172,IF(K172:N172=\"\",I172&\"・\"&J172,IF(L172:N172=\"\",I172&\"・\"&J172&\"・\"&K172,IF(M172:N172=\"\",I172&\"・\"&J172&\"・\"&K172&\"・\"&L172,IF(N172=\"\",I172&\"・\"&J172&\"・\"&K172&\"・\"&L172&\"・\"&M172,I172&\"・\"&J172&\"・\"&K172&\"・\"&L172&\"・\"&M172&\"・\"&N172))))))","v":""},"","","","",""]
[null,{"$f":"データリスト!N$46","v":"支部・各種委員会・協議会"},{"$f":"IF(データリスト!$N51=\"\",\"\",データリスト!$N51)","v":""},{"$nulls":17},{"$f":"IF(I173:N173=\"\",\"\",IF(J173:N173=\"\",I173,IF(K173:N173=\"\",I173&\"・\"&J173,IF(L173:N173=\"\",I173&\"・\"&J173&\"・\"&K173,IF(M173:N173=\"\",I173&\"・\"&J173&\"・\"&K173&\"・\"&L173,IF(N173=\"\",I173&\"・\"&J173&\"・\"&K173&\"・\"&L173&\"・\"&M173,I173&\"・\"&J173&\"・\"&K173&\"・\"&L173&\"・\"&M173&\"・\"&N173))))))","v":""},"","","","",""]
[null,{"$f":"データリスト!N$46","v":"支部・各種委員会・協議会"},{"$f":"IF(データリスト!$N52=\"\",\"\",データリスト!$N52)","v":""},{"$nulls":17},{"$f":"IF(I174:N174=\"\",\"\",IF(J174:N174=\"\",I174,IF(K174:N174=\"\",I174&\"・\"&J174,IF(L174:N174=\"\",I174&\"・\"&J174&\"・\"&K174,IF(M174:N174=\"\",I174&\"・\"&J174&\"・\"&K174&\"・\"&L174,IF(N174=\"\",I174&\"・\"&J174&\"・\"&K174&\"・\"&L174&\"・\"&M174,I174&\"・\"&J174&\"・\"&K174&\"・\"&L174&\"・\"&M174&\"・\"&N174))))))","v":""},"","","","",""]
[null,{"$f":"データリスト!N$46","v":"支部・各種委員会・協議会"},{"$f":"IF(データリスト!$N53=\"\",\"\",データリスト!$N53)","v":""},{"$nulls":17},{"$f":"IF(I175:N175=\"\",\"\",IF(J175:N175=\"\",I175,IF(K175:N175=\"\",I175&\"・\"&J175,IF(L175:N175=\"\",I175&\"・\"&J175&\"・\"&K175,IF(M175:N175=\"\",I175&\"・\"&J175&\"・\"&K175&\"・\"&L175,IF(N175=\"\",I175&\"・\"&J175&\"・\"&K175&\"・\"&L175&\"・\"&M175,I175&\"・\"&J175&\"・\"&K175&\"・\"&L175&\"・\"&M175&\"・\"&N175))))))","v":""},"","","","",""]
[null,{"$f":"データリスト!N$46","v":"支部・各種委員会・協議会"},{"$f":"IF(データリスト!$N54=\"\",\"\",データリスト!$N54)","v":""},{"$nulls":17},{"$f":"IF(I176:N176=\"\",\"\",IF(J176:N176=\"\",I176,IF(K176:N176=\"\",I176&\"・\"&J176,IF(L176:N176=\"\",I176&\"・\"&J176&\"・\"&K176,IF(M176:N176=\"\",I176&\"・\"&J176&\"・\"&K176&\"・\"&L176,IF(N176=\"\",I176&\"・\"&J176&\"・\"&K176&\"・\"&L176&\"・\"&M176,I176&\"・\"&J176&\"・\"&K176&\"・\"&L176&\"・\"&M176&\"・\"&N176))))))","v":""},"","","","",""]
[null,{"$f":"データリスト!N$46","v":"支部・各種委員会・協議会"},{"$f":"IF(データリスト!$N55=\"\",\"\",データリスト!$N55)","v":""},{"$nulls":17},{"$f":"IF(I177:N177=\"\",\"\",IF(J177:N177=\"\",I177,IF(K177:N177=\"\",I177&\"・\"&J177,IF(L177:N177=\"\",I177&\"・\"&J177&\"・\"&K177,IF(M177:N177=\"\",I177&\"・\"&J177&\"・\"&K177&\"・\"&L177,IF(N177=\"\",I177&\"・\"&J177&\"・\"&K177&\"・\"&L177&\"・\"&M177,I177&\"・\"&J177&\"・\"&K177&\"・\"&L177&\"・\"&M177&\"・\"&N177))))))","v":""},"","","","",""]
[null,{"$f":"データリスト!N$46","v":"支部・各種委員会・協議会"},{"$f":"IF(データリスト!$N56=\"\",\"\",データリスト!$N56)","v":""},{"$nulls":17},{"$f":"IF(I178:N178=\"\",\"\",IF(J178:N178=\"\",I178,IF(K178:N178=\"\",I178&\"・\"&J178,IF(L178:N178=\"\",I178&\"・\"&J178&\"・\"&K178,IF(M178:N178=\"\",I178&\"・\"&J178&\"・\"&K178&\"・\"&L178,IF(N178=\"\",I178&\"・\"&J178&\"・\"&K178&\"・\"&L178&\"・\"&M178,I178&\"・\"&J178&\"・\"&K178&\"・\"&L178&\"・\"&M178&\"・\"&N178))))))","v":""},"","","","",""]
[null,{"$f":"データリスト!N$46","v":"支部・各種委員会・協議会"},{"$f":"IF(データリスト!$N57=\"\",\"\",データリスト!$N57)","v":""},{"$nulls":17},{"$f":"IF(I179:N179=\"\",\"\",IF(J179:N179=\"\",I179,IF(K179:N179=\"\",I179&\"・\"&J179,IF(L179:N179=\"\",I179&\"・\"&J179&\"・\"&K179,IF(M179:N179=\"\",I179&\"・\"&J179&\"・\"&K179&\"・\"&L179,IF(N179=\"\",I179&\"・\"&J179&\"・\"&K179&\"・\"&L179&\"・\"&M179,I179&\"・\"&J179&\"・\"&K179&\"・\"&L179&\"・\"&M179&\"・\"&N179))))))","v":""},"","","","",""]
[null,{"$f":"データリスト!N$46","v":"支部・各種委員会・協議会"},{"$f":"IF(データリスト!$N58=\"\",\"\",データリスト!$N58)","v":""},{"$nulls":17},{"$f":"IF(I180:N180=\"\",\"\",IF(J180:N180=\"\",I180,IF(K180:N180=\"\",I180&\"・\"&J180,IF(L180:N180=\"\",I180&\"・\"&J180&\"・\"&K180,IF(M180:N180=\"\",I180&\"・\"&J180&\"・\"&K180&\"・\"&L180,IF(N180=\"\",I180&\"・\"&J180&\"・\"&K180&\"・\"&L180&\"・\"&M180,I180&\"・\"&J180&\"・\"&K180&\"・\"&L180&\"・\"&M180&\"・\"&N180))))))","v":""},"","","","",""]
[null,{"$f":"データリスト!N$46","v":"支部・各種委員会・協議会"},{"$f":"IF(データリスト!$N59=\"\",\"\",データリスト!$N59)","v":""},{"$nulls":17},{"$f":"IF(I181:N181=\"\",\"\",IF(J181:N181=\"\",I181,IF(K181:N181=\"\",I181&\"・\"&J181,IF(L181:N181=\"\",I181&\"・\"&J181&\"・\"&K181,IF(M181:N181=\"\",I181&\"・\"&J181&\"・\"&K181&\"・\"&L181,IF(N181=\"\",I181&\"・\"&J181&\"・\"&K181&\"・\"&L181&\"・\"&M181,I181&\"・\"&J181&\"・\"&K181&\"・\"&L181&\"・\"&M181&\"・\"&N181))))))","v":""},"","","","",""]
[null,{"$f":"データリスト!N$46","v":"支部・各種委員会・協議会"},{"$f":"IF(データリスト!$N60=\"\",\"\",データリスト!$N60)","v":""},{"$nulls":17},{"$f":"IF(I182:N182=\"\",\"\",IF(J182:N182=\"\",I182,IF(K182:N182=\"\",I182&\"・\"&J182,IF(L182:N182=\"\",I182&\"・\"&J182&\"・\"&K182,IF(M182:N182=\"\",I182&\"・\"&J182&\"・\"&K182&\"・\"&L182,IF(N182=\"\",I182&\"・\"&J182&\"・\"&K182&\"・\"&L182&\"・\"&M182,I182&\"・\"&J182&\"・\"&K182&\"・\"&L182&\"・\"&M182&\"・\"&N182))))))","v":""},"","","","",""]
[null,{"$f":"データリスト!N$46","v":"支部・各種委員会・協議会"},{"$f":"IF(データリスト!$N61=\"\",\"\",データリスト!$N61)","v":""},{"$nulls":17},{"$f":"IF(I183:N183=\"\",\"\",IF(J183:N183=\"\",I183,IF(K183:N183=\"\",I183&\"・\"&J183,IF(L183:N183=\"\",I183&\"・\"&J183&\"・\"&K183,IF(M183:N183=\"\",I183&\"・\"&J183&\"・\"&K183&\"・\"&L183,IF(N183=\"\",I183&\"・\"&J183&\"・\"&K183&\"・\"&L183&\"・\"&M183,I183&\"・\"&J183&\"・\"&K183&\"・\"&L183&\"・\"&M183&\"・\"&N183))))))","v":""},"","","","",""]
[null,{"$f":"データリスト!N$46","v":"支部・各種委員会・協議会"},{"$f":"IF(データリスト!$N62=\"\",\"\",データリスト!$N62)","v":""},{"$nulls":17},{"$f":"IF(I184:N184=\"\",\"\",IF(J184:N184=\"\",I184,IF(K184:N184=\"\",I184&\"・\"&J184,IF(L184:N184=\"\",I184&\"・\"&J184&\"・\"&K184,IF(M184:N184=\"\",I184&\"・\"&J184&\"・\"&K184&\"・\"&L184,IF(N184=\"\",I184&\"・\"&J184&\"・\"&K184&\"・\"&L184&\"・\"&M184,I184&\"・\"&J184&\"・\"&K184&\"・\"&L184&\"・\"&M184&\"・\"&N184))))))","v":""},"","","","",""]
[null,{"$f":"データリスト!N$46","v":"支部・各種委員会・協議会"},{"$f":"IF(データリスト!$N63=\"\",\"\",データリスト!$N63)","v":""},{"$nulls":17},{"$f":"IF(I185:N185=\"\",\"\",IF(J185:N185=\"\",I185,IF(K185:N185=\"\",I185&\"・\"&J185,IF(L185:N185=\"\",I185&\"・\"&J185&\"・\"&K185,IF(M185:N185=\"\",I185&\"・\"&J185&\"・\"&K185&\"・\"&L185,IF(N185=\"\",I185&\"・\"&J185&\"・\"&K185&\"・\"&L185&\"・\"&M185,I185&\"・\"&J185&\"・\"&K185&\"・\"&L185&\"・\"&M185&\"・\"&N185))))))","v":""},"","","","",""]
[null,{"$f":"データリスト!N$46","v":"支部・各種委員会・協議会"},{"$f":"IF(データリスト!$N64=\"\",\"\",データリスト!$N64)","v":""},{"$nulls":17},{"$f":"IF(I186:N186=\"\",\"\",IF(J186:N186=\"\",I186,IF(K186:N186=\"\",I186&\"・\"&J186,IF(L186:N186=\"\",I186&\"・\"&J186&\"・\"&K186,IF(M186:N186=\"\",I186&\"・\"&J186&\"・\"&K186&\"・\"&L186,IF(N186=\"\",I186&\"・\"&J186&\"・\"&K186&\"・\"&L186&\"・\"&M186,I186&\"・\"&J186&\"・\"&K186&\"・\"&L186&\"・\"&M186&\"・\"&N186))))))","v":""},"","","","",""]
[null,{"$f":"データリスト!N$46","v":"支部・各種委員会・協議会"},{"$f":"IF(データリスト!$N65=\"\",\"\",データリスト!$N65)","v":""},{"$nulls":17},{"$f":"IF(I187:N187=\"\",\"\",IF(J187:N187=\"\",I187,IF(K187:N187=\"\",I187&\"・\"&J187,IF(L187:N187=\"\",I187&\"・\"&J187&\"・\"&K187,IF(M187:N187=\"\",I187&\"・\"&J187&\"・\"&K187&\"・\"&L187,IF(N187=\"\",I187&\"・\"&J187&\"・\"&K187&\"・\"&L187&\"・\"&M187,I187&\"・\"&J187&\"・\"&K187&\"・\"&L187&\"・\"&M187&\"・\"&N187))))))","v":""},"","","","",""]
[null,{"$f":"データリスト!N$46","v":"支部・各種委員会・協議会"},{"$f":"IF(データリスト!$N66=\"\",\"\",データリスト!$N66)","v":""},{"$nulls":17},{"$f":"IF(I188:N188=\"\",\"\",IF(J188:N188=\"\",I188,IF(K188:N188=\"\",I188&\"・\"&J188,IF(L188:N188=\"\",I188&\"・\"&J188&\"・\"&K188,IF(M188:N188=\"\",I188&\"・\"&J188&\"・\"&K188&\"・\"&L188,IF(N188=\"\",I188&\"・\"&J188&\"・\"&K188&\"・\"&L188&\"・\"&M188,I188&\"・\"&J188&\"・\"&K188&\"・\"&L188&\"・\"&M188&\"・\"&N188))))))","v":""},"","","","",""]
[null,{"$f":"データリスト!O$46","v":"会社提案・協議申入れ"},{"$f":"IF(データリスト!$O47=\"\",\"\",データリスト!$O47)","v":"申入れ内容の周知"},{"$nulls":17},{"$f":"IF(I189:N189=\"\",\"\",IF(J189:N189=\"\",I189,IF(K189:N189=\"\",I189&\"・\"&J189,IF(L189:N189=\"\",I189&\"・\"&J189&\"・\"&K189,IF(M189:N189=\"\",I189&\"・\"&J189&\"・\"&K189&\"・\"&L189,IF(N189=\"\",I189&\"・\"&J189&\"・\"&K189&\"・\"&L189&\"・\"&M189,I189&\"・\"&J189&\"・\"&K189&\"・\"&L189&\"・\"&M189&\"・\"&N189))))))","v":""},"","","","",""]
[null,{"$f":"データリスト!O$46","v":"会社提案・協議申入れ"},{"$f":"IF(データリスト!$O48=\"\",\"\",データリスト!$O48)","v":"分会集会の開催"},{"$nulls":17},{"$f":"IF(I190:N190=\"\",\"\",IF(J190:N190=\"\",I190,IF(K190:N190=\"\",I190&\"・\"&J190,IF(L190:N190=\"\",I190&\"・\"&J190&\"・\"&K190,IF(M190:N190=\"\",I190&\"・\"&J190&\"・\"&K190&\"・\"&L190,IF(N190=\"\",I190&\"・\"&J190&\"・\"&K190&\"・\"&L190&\"・\"&M190,I190&\"・\"&J190&\"・\"&K190&\"・\"&L190&\"・\"&M190&\"・\"&N190))))))","v":""},"","","","",""]
[null,{"$f":"データリスト!O$46","v":"会社提案・協議申入れ"},{"$f":"IF(データリスト!$O49=\"\",\"\",データリスト!$O49)","v":"意見集約"},{"$nulls":17},{"$f":"IF(I191:N191=\"\",\"\",IF(J191:N191=\"\",I191,IF(K191:N191=\"\",I191&\"・\"&J191,IF(L191:N191=\"\",I191&\"・\"&J191&\"・\"&K191,IF(M191:N191=\"\",I191&\"・\"&J191&\"・\"&K191&\"・\"&L191,IF(N191=\"\",I191&\"・\"&J191&\"・\"&K191&\"・\"&L191&\"・\"&M191,I191&\"・\"&J191&\"・\"&K191&\"・\"&L191&\"・\"&M191&\"・\"&N191))))))","v":""},"","","","",""]
[null,{"$f":"データリスト!O$46","v":"会社提案・協議申入れ"},{"$f":"IF(データリスト!$O50=\"\",\"\",データリスト!$O50)","v":"報告"},{"$nulls":17},{"$f":"IF(I192:N192=\"\",\"\",IF(J192:N192=\"\",I192,IF(K192:N192=\"\",I192&\"・\"&J192,IF(L192:N192=\"\",I192&\"・\"&J192&\"・\"&K192,IF(M192:N192=\"\",I192&\"・\"&J192&\"・\"&K192&\"・\"&L192,IF(N192=\"\",I192&\"・\"&J192&\"・\"&K192&\"・\"&L192&\"・\"&M192,I192&\"・\"&J192&\"・\"&K192&\"・\"&L192&\"・\"&M192&\"・\"&N192))))))","v":""},"","","","",""]
[null,{"$f":"データリスト!O$46","v":"会社提案・協議申入れ"},{"$f":"IF(データリスト!$O51=\"\",\"\",データリスト!$O51)","v":""},{"$nulls":17},{"$f":"IF(I193:N193=\"\",\"\",IF(J193:N193=\"\",I193,IF(K193:N193=\"\",I193&\"・\"&J193,IF(L193:N193=\"\",I193&\"・\"&J193&\"・\"&K193,IF(M193:N193=\"\",I193&\"・\"&J193&\"・\"&K193&\"・\"&L193,IF(N193=\"\",I193&\"・\"&J193&\"・\"&K193&\"・\"&L193&\"・\"&M193,I193&\"・\"&J193&\"・\"&K193&\"・\"&L193&\"・\"&M193&\"・\"&N193))))))","v":""},"","","","",""]
[null,{"$f":"データリスト!O$46","v":"会社提案・協議申入れ"},{"$f":"IF(データリスト!$O52=\"\",\"\",データリスト!$O52)","v":""},{"$nulls":17},{"$f":"IF(I194:N194=\"\",\"\",IF(J194:N194=\"\",I194,IF(K194:N194=\"\",I194&\"・\"&J194,IF(L194:N194=\"\",I194&\"・\"&J194&\"・\"&K194,IF(M194:N194=\"\",I194&\"・\"&J194&\"・\"&K194&\"・\"&L194,IF(N194=\"\",I194&\"・\"&J194&\"・\"&K194&\"・\"&L194&\"・\"&M194,I194&\"・\"&J194&\"・\"&K194&\"・\"&L194&\"・\"&M194&\"・\"&N194))))))","v":""},"","","","",""]
[null,{"$f":"データリスト!O$46","v":"会社提案・協議申入れ"},{"$f":"IF(データリスト!$O53=\"\",\"\",データリスト!$O53)","v":""},{"$nulls":17},{"$f":"IF(I195:N195=\"\",\"\",IF(J195:N195=\"\",I195,IF(K195:N195=\"\",I195&\"・\"&J195,IF(L195:N195=\"\",I195&\"・\"&J195&\"・\"&K195,IF(M195:N195=\"\",I195&\"・\"&J195&\"・\"&K195&\"・\"&L195,IF(N195=\"\",I195&\"・\"&J195&\"・\"&K195&\"・\"&L195&\"・\"&M195,I195&\"・\"&J195&\"・\"&K195&\"・\"&L195&\"・\"&M195&\"・\"&N195))))))","v":""},"","","","",""]
[null,{"$f":"データリスト!O$46","v":"会社提案・協議申入れ"},{"$f":"IF(データリスト!$O54=\"\",\"\",データリスト!$O54)","v":""},{"$nulls":17},{"$f":"IF(I196:N196=\"\",\"\",IF(J196:N196=\"\",I196,IF(K196:N196=\"\",I196&\"・\"&J196,IF(L196:N196=\"\",I196&\"・\"&J196&\"・\"&K196,IF(M196:N196=\"\",I196&\"・\"&J196&\"・\"&K196&\"・\"&L196,IF(N196=\"\",I196&\"・\"&J196&\"・\"&K196&\"・\"&L196&\"・\"&M196,I196&\"・\"&J196&\"・\"&K196&\"・\"&L196&\"・\"&M196&\"・\"&N196))))))","v":""},"","","","",""]
[null,{"$f":"データリスト!O$46","v":"会社提案・協議申入れ"},{"$f":"IF(データリスト!$O55=\"\",\"\",データリスト!$O55)","v":""},{"$nulls":17},{"$f":"IF(I197:N197=\"\",\"\",IF(J197:N197=\"\",I197,IF(K197:N197=\"\",I197&\"・\"&J197,IF(L197:N197=\"\",I197&\"・\"&J197&\"・\"&K197,IF(M197:N197=\"\",I197&\"・\"&J197&\"・\"&K197&\"・\"&L197,IF(N197=\"\",I197&\"・\"&J197&\"・\"&K197&\"・\"&L197&\"・\"&M197,I197&\"・\"&J197&\"・\"&K197&\"・\"&L197&\"・\"&M197&\"・\"&N197))))))","v":""},"","","","",""]
[null,{"$f":"データリスト!O$46","v":"会社提案・協議申入れ"},{"$f":"IF(データリスト!$O56=\"\",\"\",データリスト!$O56)","v":""},{"$nulls":17},{"$f":"IF(I198:N198=\"\",\"\",IF(J198:N198=\"\",I198,IF(K198:N198=\"\",I198&\"・\"&J198,IF(L198:N198=\"\",I198&\"・\"&J198&\"・\"&K198,IF(M198:N198=\"\",I198&\"・\"&J198&\"・\"&K198&\"・\"&L198,IF(N198=\"\",I198&\"・\"&J198&\"・\"&K198&\"・\"&L198&\"・\"&M198,I198&\"・\"&J198&\"・\"&K198&\"・\"&L198&\"・\"&M198&\"・\"&N198))))))","v":""},"","","","",""]
[null,{"$f":"データリスト!O$46","v":"会社提案・協議申入れ"},{"$f":"IF(データリスト!$O57=\"\",\"\",データリスト!$O57)","v":""},{"$nulls":17},{"$f":"IF(I199:N199=\"\",\"\",IF(J199:N199=\"\",I199,IF(K199:N199=\"\",I199&\"・\"&J199,IF(L199:N199=\"\",I199&\"・\"&J199&\"・\"&K199,IF(M199:N199=\"\",I199&\"・\"&J199&\"・\"&K199&\"・\"&L199,IF(N199=\"\",I199&\"・\"&J199&\"・\"&K199&\"・\"&L199&\"・\"&M199,I199&\"・\"&J199&\"・\"&K199&\"・\"&L199&\"・\"&M199&\"・\"&N199))))))","v":""},"","","","",""]
[null,{"$f":"データリスト!O$46","v":"会社提案・協議申入れ"},{"$f":"IF(データリスト!$O58=\"\",\"\",データリスト!$O58)","v":""},{"$nulls":17},{"$f":"IF(I200:N200=\"\",\"\",IF(J200:N200=\"\",I200,IF(K200:N200=\"\",I200&\"・\"&J200,IF(L200:N200=\"\",I200&\"・\"&J200&\"・\"&K200,IF(M200:N200=\"\",I200&\"・\"&J200&\"・\"&K200&\"・\"&L200,IF(N200=\"\",I200&\"・\"&J200&\"・\"&K200&\"・\"&L200&\"・\"&M200,I200&\"・\"&J200&\"・\"&K200&\"・\"&L200&\"・\"&M200&\"・\"&N200))))))","v":""},"","","","",""]
[null,{"$f":"データリスト!O$46","v":"会社提案・協議申入れ"},{"$f":"IF(データリスト!$O59=\"\",\"\",データリスト!$O59)","v":""},{"$nulls":17},{"$f":"IF(I201:N201=\"\",\"\",IF(J201:N201=\"\",I201,IF(K201:N201=\"\",I201&\"・\"&J201,IF(L201:N201=\"\",I201&\"・\"&J201&\"・\"&K201,IF(M201:N201=\"\",I201&\"・\"&J201&\"・\"&K201&\"・\"&L201,IF(N201=\"\",I201&\"・\"&J201&\"・\"&K201&\"・\"&L201&\"・\"&M201,I201&\"・\"&J201&\"・\"&K201&\"・\"&L201&\"・\"&M201&\"・\"&N201))))))","v":""},"","","","",""]
[null,{"$f":"データリスト!O$46","v":"会社提案・協議申入れ"},{"$f":"IF(データリスト!$O60=\"\",\"\",データリスト!$O60)","v":""},{"$nulls":17},{"$f":"IF(I202:N202=\"\",\"\",IF(J202:N202=\"\",I202,IF(K202:N202=\"\",I202&\"・\"&J202,IF(L202:N202=\"\",I202&\"・\"&J202&\"・\"&K202,IF(M202:N202=\"\",I202&\"・\"&J202&\"・\"&K202&\"・\"&L202,IF(N202=\"\",I202&\"・\"&J202&\"・\"&K202&\"・\"&L202&\"・\"&M202,I202&\"・\"&J202&\"・\"&K202&\"・\"&L202&\"・\"&M202&\"・\"&N202))))))","v":""},"","","","",""]
[null,{"$f":"データリスト!O$46","v":"会社提案・協議申入れ"},{"$f":"IF(データリスト!$O61=\"\",\"\",データリスト!$O61)","v":""},{"$nulls":17},{"$f":"IF(I203:N203=\"\",\"\",IF(J203:N203=\"\",I203,IF(K203:N203=\"\",I203&\"・\"&J203,IF(L203:N203=\"\",I203&\"・\"&J203&\"・\"&K203,IF(M203:N203=\"\",I203&\"・\"&J203&\"・\"&K203&\"・\"&L203,IF(N203=\"\",I203&\"・\"&J203&\"・\"&K203&\"・\"&L203&\"・\"&M203,I203&\"・\"&J203&\"・\"&K203&\"・\"&L203&\"・\"&M203&\"・\"&N203))))))","v":""},"","","","",""]
[null,{"$f":"データリスト!O$46","v":"会社提案・協議申入れ"},{"$f":"IF(データリスト!$O62=\"\",\"\",データリスト!$O62)","v":""},{"$nulls":17},{"$f":"IF(I204:N204=\"\",\"\",IF(J204:N204=\"\",I204,IF(K204:N204=\"\",I204&\"・\"&J204,IF(L204:N204=\"\",I204&\"・\"&J204&\"・\"&K204,IF(M204:N204=\"\",I204&\"・\"&J204&\"・\"&K204&\"・\"&L204,IF(N204=\"\",I204&\"・\"&J204&\"・\"&K204&\"・\"&L204&\"・\"&M204,I204&\"・\"&J204&\"・\"&K204&\"・\"&L204&\"・\"&M204&\"・\"&N204))))))","v":""},"","","","",""]
[null,{"$f":"データリスト!O$46","v":"会社提案・協議申入れ"},{"$f":"IF(データリスト!$O63=\"\",\"\",データリスト!$O63)","v":""},{"$nulls":17},{"$f":"IF(I205:N205=\"\",\"\",IF(J205:N205=\"\",I205,IF(K205:N205=\"\",I205&\"・\"&J205,IF(L205:N205=\"\",I205&\"・\"&J205&\"・\"&K205,IF(M205:N205=\"\",I205&\"・\"&J205&\"・\"&K205&\"・\"&L205,IF(N205=\"\",I205&\"・\"&J205&\"・\"&K205&\"・\"&L205&\"・\"&M205,I205&\"・\"&J205&\"・\"&K205&\"・\"&L205&\"・\"&M205&\"・\"&N205))))))","v":""},"","","","",""]
[null,{"$f":"データリスト!O$46","v":"会社提案・協議申入れ"},{"$f":"IF(データリスト!$O64=\"\",\"\",データリスト!$O64)","v":""},{"$nulls":17},{"$f":"IF(I206:N206=\"\",\"\",IF(J206:N206=\"\",I206,IF(K206:N206=\"\",I206&\"・\"&J206,IF(L206:N206=\"\",I206&\"・\"&J206&\"・\"&K206,IF(M206:N206=\"\",I206&\"・\"&J206&\"・\"&K206&\"・\"&L206,IF(N206=\"\",I206&\"・\"&J206&\"・\"&K206&\"・\"&L206&\"・\"&M206,I206&\"・\"&J206&\"・\"&K206&\"・\"&L206&\"・\"&M206&\"・\"&N206))))))","v":""},"","","","",""]
[null,{"$f":"データリスト!O$46","v":"会社提案・協議申入れ"},{"$f":"IF(データリスト!$O65=\"\",\"\",データリスト!$O65)","v":""},{"$nulls":17},{"$f":"IF(I207:N207=\"\",\"\",IF(J207:N207=\"\",I207,IF(K207:N207=\"\",I207&\"・\"&J207,IF(L207:N207=\"\",I207&\"・\"&J207&\"・\"&K207,IF(M207:N207=\"\",I207&\"・\"&J207&\"・\"&K207&\"・\"&L207,IF(N207=\"\",I207&\"・\"&J207&\"・\"&K207&\"・\"&L207&\"・\"&M207,I207&\"・\"&J207&\"・\"&K207&\"・\"&L207&\"・\"&M207&\"・\"&N207))))))","v":""},"","","","",""]
[null,{"$f":"データリスト!O$46","v":"会社提案・協議申入れ"},{"$f":"IF(データリスト!$O66=\"\",\"\",データリスト!$O66)","v":""},{"$nulls":17},{"$f":"IF(I208:N208=\"\",\"\",IF(J208:N208=\"\",I208,IF(K208:N208=\"\",I208&\"・\"&J208,IF(L208:N208=\"\",I208&\"・\"&J208&\"・\"&K208,IF(M208:N208=\"\",I208&\"・\"&J208&\"・\"&K208&\"・\"&L208,IF(N208=\"\",I208&\"・\"&J208&\"・\"&K208&\"・\"&L208&\"・\"&M208,I208&\"・\"&J208&\"・\"&K208&\"・\"&L208&\"・\"&M208&\"・\"&N208))))))","v":""},"","","","",""]
[null,{"$f":"データリスト!P$46","v":"分会大会"},{"$f":"IF(データリスト!$P47=\"\",\"\",データリスト!$P47)","v":"会計監査"},{"$nulls":17},{"$f":"IF(I209:N209=\"\",\"\",IF(J209:N209=\"\",I209,IF(K209:N209=\"\",I209&\"・\"&J209,IF(L209:N209=\"\",I209&\"・\"&J209&\"・\"&K209,IF(M209:N209=\"\",I209&\"・\"&J209&\"・\"&K209&\"・\"&L209,IF(N209=\"\",I209&\"・\"&J209&\"・\"&K209&\"・\"&L209&\"・\"&M209,I209&\"・\"&J209&\"・\"&K209&\"・\"&L209&\"・\"&M209&\"・\"&N209))))))","v":""},"","","","",""]
[null,{"$f":"データリスト!P$46","v":"分会大会"},{"$f":"IF(データリスト!$P48=\"\",\"\",データリスト!$P48)","v":"周知(職場・会社依頼)"},{"$nulls":17},{"$f":"IF(I210:N210=\"\",\"\",IF(J210:N210=\"\",I210,IF(K210:N210=\"\",I210&\"・\"&J210,IF(L210:N210=\"\",I210&\"・\"&J210&\"・\"&K210,IF(M210:N210=\"\",I210&\"・\"&J210&\"・\"&K210&\"・\"&L210,IF(N210=\"\",I210&\"・\"&J210&\"・\"&K210&\"・\"&L210&\"・\"&M210,I210&\"・\"&J210&\"・\"&K210&\"・\"&L210&\"・\"&M210&\"・\"&N210))))))","v":""},"","","","",""]
[null,{"$f":"データリスト!P$46","v":"分会大会"},{"$f":"IF(データリスト!$P49=\"\",\"\",データリスト!$P49)","v":"事前準備(資料作成)"},{"$nulls":17},{"$f":"IF(I211:N211=\"\",\"\",IF(J211:N211=\"\",I211,IF(K211:N211=\"\",I211&\"・\"&J211,IF(L211:N211=\"\",I211&\"・\"&J211&\"・\"&K211,IF(M211:N211=\"\",I211&\"・\"&J211&\"・\"&K211&\"・\"&L211,IF(N211=\"\",I211&\"・\"&J211&\"・\"&K211&\"・\"&L211&\"・\"&M211,I211&\"・\"&J211&\"・\"&K211&\"・\"&L211&\"・\"&M211&\"・\"&N211))))))","v":""},"","","","",""]
[null,{"$f":"データリスト!P$46","v":"分会大会"},{"$f":"IF(データリスト!$P50=\"\",\"\",データリスト!$P50)","v":"事前準備(会場手配・設営・撤収)"},{"$nulls":17},{"$f":"IF(I212:N212=\"\",\"\",IF(J212:N212=\"\",I212,IF(K212:N212=\"\",I212&\"・\"&J212,IF(L212:N212=\"\",I212&\"・\"&J212&\"・\"&K212,IF(M212:N212=\"\",I212&\"・\"&J212&\"・\"&K212&\"・\"&L212,IF(N212=\"\",I212&\"・\"&J212&\"・\"&K212&\"・\"&L212&\"・\"&M212,I212&\"・\"&J212&\"・\"&K212&\"・\"&L212&\"・\"&M212&\"・\"&N212))))))","v":""},"","","","",""]
[null,{"$f":"データリスト!P$46","v":"分会大会"},{"$f":"IF(データリスト!$P51=\"\",\"\",データリスト!$P51)","v":"事前準備(買い出し)"},{"$nulls":17},{"$f":"IF(I213:N213=\"\",\"\",IF(J213:N213=\"\",I213,IF(K213:N213=\"\",I213&\"・\"&J213,IF(L213:N213=\"\",I213&\"・\"&J213&\"・\"&K213,IF(M213:N213=\"\",I213&\"・\"&J213&\"・\"&K213&\"・\"&L213,IF(N213=\"\",I213&\"・\"&J213&\"・\"&K213&\"・\"&L213&\"・\"&M213,I213&\"・\"&J213&\"・\"&K213&\"・\"&L213&\"・\"&M213&\"・\"&N213))))))","v":""},"","","","",""]
[null,{"$f":"データリスト!P$46","v":"分会大会"},{"$f":"IF(データリスト!$P52=\"\",\"\",データリスト!$P52)","v":"各種役員依頼"},{"$nulls":17},{"$f":"IF(I214:N214=\"\",\"\",IF(J214:N214=\"\",I214,IF(K214:N214=\"\",I214&\"・\"&J214,IF(L214:N214=\"\",I214&\"・\"&J214&\"・\"&K214,IF(M214:N214=\"\",I214&\"・\"&J214&\"・\"&K214&\"・\"&L214,IF(N214=\"\",I214&\"・\"&J214&\"・\"&K214&\"・\"&L214&\"・\"&M214,I214&\"・\"&J214&\"・\"&K214&\"・\"&L214&\"・\"&M214&\"・\"&N214))))))","v":""},"","","","",""]
[null,{"$f":"データリスト!P$46","v":"分会大会"},{"$f":"IF(データリスト!$P53=\"\",\"\",データリスト!$P53)","v":"会場設営"},{"$nulls":17},{"$f":"IF(I215:N215=\"\",\"\",IF(J215:N215=\"\",I215,IF(K215:N215=\"\",I215&\"・\"&J215,IF(L215:N215=\"\",I215&\"・\"&J215&\"・\"&K215,IF(M215:N215=\"\",I215&\"・\"&J215&\"・\"&K215&\"・\"&L215,IF(N215=\"\",I215&\"・\"&J215&\"・\"&K215&\"・\"&L215&\"・\"&M215,I215&\"・\"&J215&\"・\"&K215&\"・\"&L215&\"・\"&M215&\"・\"&N215))))))","v":""},"","","","",""]
[null,{"$f":"データリスト!P$46","v":"分会大会"},{"$f":"IF(データリスト!$P54=\"\",\"\",データリスト!$P54)","v":"分会大会開催"},{"$nulls":17},{"$f":"IF(I216:N216=\"\",\"\",IF(J216:N216=\"\",I216,IF(K216:N216=\"\",I216&\"・\"&J216,IF(L216:N216=\"\",I216&\"・\"&J216&\"・\"&K216,IF(M216:N216=\"\",I216&\"・\"&J216&\"・\"&K216&\"・\"&L216,IF(N216=\"\",I216&\"・\"&J216&\"・\"&K216&\"・\"&L216&\"・\"&M216,I216&\"・\"&J216&\"・\"&K216&\"・\"&L216&\"・\"&M216&\"・\"&N216))))))","v":""},"","","","",""]
[null,{"$f":"データリスト!P$46","v":"分会大会"},{"$f":"IF(データリスト!$P55=\"\",\"\",データリスト!$P55)","v":"司会進行"},{"$nulls":17},{"$f":"IF(I217:N217=\"\",\"\",IF(J217:N217=\"\",I217,IF(K217:N217=\"\",I217&\"・\"&J217,IF(L217:N217=\"\",I217&\"・\"&J217&\"・\"&K217,IF(M217:N217=\"\",I217&\"・\"&J217&\"・\"&K217&\"・\"&L217,IF(N217=\"\",I217&\"・\"&J217&\"・\"&K217&\"・\"&L217&\"・\"&M217,I217&\"・\"&J217&\"・\"&K217&\"・\"&L217&\"・\"&M217&\"・\"&N217))))))","v":""},"","","","",""]
[null,{"$f":"データリスト!P$46","v":"分会大会"},{"$f":"IF(データリスト!$P56=\"\",\"\",データリスト!$P56)","v":"活動経過報告"},{"$nulls":17},{"$f":"IF(I218:N218=\"\",\"\",IF(J218:N218=\"\",I218,IF(K218:N218=\"\",I218&\"・\"&J218,IF(L218:N218=\"\",I218&\"・\"&J218&\"・\"&K218,IF(M218:N218=\"\",I218&\"・\"&J218&\"・\"&K218&\"・\"&L218,IF(N218=\"\",I218&\"・\"&J218&\"・\"&K218&\"・\"&L218&\"・\"&M218,I218&\"・\"&J218&\"・\"&K218&\"・\"&L218&\"・\"&M218&\"・\"&N218))))))","v":""},"","","","",""]
[null,{"$f":"データリスト!P$46","v":"分会大会"},{"$f":"IF(データリスト!$P57=\"\",\"\",データリスト!$P57)","v":"会計報告"},{"$nulls":17},{"$f":"IF(I219:N219=\"\",\"\",IF(J219:N219=\"\",I219,IF(K219:N219=\"\",I219&\"・\"&J219,IF(L219:N219=\"\",I219&\"・\"&J219&\"・\"&K219,IF(M219:N219=\"\",I219&\"・\"&J219&\"・\"&K219&\"・\"&L219,IF(N219=\"\",I219&\"・\"&J219&\"・\"&K219&\"・\"&L219&\"・\"&M219,I219&\"・\"&J219&\"・\"&K219&\"・\"&L219&\"・\"&M219&\"・\"&N219))))))","v":""},"","","","",""]
[null,{"$f":"データリスト!P$46","v":"分会大会"},{"$f":"IF(データリスト!$P58=\"\",\"\",データリスト!$P58)","v":"会計監査報告"},{"$nulls":17},{"$f":"IF(I220:N220=\"\",\"\",IF(J220:N220=\"\",I220,IF(K220:N220=\"\",I220&\"・\"&J220,IF(L220:N220=\"\",I220&\"・\"&J220&\"・\"&K220,IF(M220:N220=\"\",I220&\"・\"&J220&\"・\"&K220&\"・\"&L220,IF(N220=\"\",I220&\"・\"&J220&\"・\"&K220&\"・\"&L220&\"・\"&M220,I220&\"・\"&J220&\"・\"&K220&\"・\"&L220&\"・\"&M220&\"・\"&N220))))))","v":""},"","","","",""]
[null,{"$f":"データリスト!P$46","v":"分会大会"},{"$f":"IF(データリスト!$P59=\"\",\"\",データリスト!$P59)","v":"議案の上程"},{"$nulls":17},{"$f":"IF(I221:N221=\"\",\"\",IF(J221:N221=\"\",I221,IF(K221:N221=\"\",I221&\"・\"&J221,IF(L221:N221=\"\",I221&\"・\"&J221&\"・\"&K221,IF(M221:N221=\"\",I221&\"・\"&J221&\"・\"&K221&\"・\"&L221,IF(N221=\"\",I221&\"・\"&J221&\"・\"&K221&\"・\"&L221&\"・\"&M221,I221&\"・\"&J221&\"・\"&K221&\"・\"&L221&\"・\"&M221&\"・\"&N221))))))","v":""},"","","","",""]
[null,{"$f":"データリスト!P$46","v":"分会大会"},{"$f":"IF(データリスト!$P60=\"\",\"\",データリスト!$P60)","v":""},{"$nulls":17},{"$f":"IF(I222:N222=\"\",\"\",IF(J222:N222=\"\",I222,IF(K222:N222=\"\",I222&\"・\"&J222,IF(L222:N222=\"\",I222&\"・\"&J222&\"・\"&K222,IF(M222:N222=\"\",I222&\"・\"&J222&\"・\"&K222&\"・\"&L222,IF(N222=\"\",I222&\"・\"&J222&\"・\"&K222&\"・\"&L222&\"・\"&M222,I222&\"・\"&J222&\"・\"&K222&\"・\"&L222&\"・\"&M222&\"・\"&N222))))))","v":""},"","","","",""]
[null,{"$f":"データリスト!P$46","v":"分会大会"},{"$f":"IF(データリスト!$P61=\"\",\"\",データリスト!$P61)","v":""},{"$nulls":17},{"$f":"IF(I223:N223=\"\",\"\",IF(J223:N223=\"\",I223,IF(K223:N223=\"\",I223&\"・\"&J223,IF(L223:N223=\"\",I223&\"・\"&J223&\"・\"&K223,IF(M223:N223=\"\",I223&\"・\"&J223&\"・\"&K223&\"・\"&L223,IF(N223=\"\",I223&\"・\"&J223&\"・\"&K223&\"・\"&L223&\"・\"&M223,I223&\"・\"&J223&\"・\"&K223&\"・\"&L223&\"・\"&M223&\"・\"&N223))))))","v":""},"","","","",""]
[null,{"$f":"データリスト!P$46","v":"分会大会"},{"$f":"IF(データリスト!$P62=\"\",\"\",データリスト!$P62)","v":""},{"$nulls":17},{"$f":"IF(I224:N224=\"\",\"\",IF(J224:N224=\"\",I224,IF(K224:N224=\"\",I224&\"・\"&J224,IF(L224:N224=\"\",I224&\"・\"&J224&\"・\"&K224,IF(M224:N224=\"\",I224&\"・\"&J224&\"・\"&K224&\"・\"&L224,IF(N224=\"\",I224&\"・\"&J224&\"・\"&K224&\"・\"&L224&\"・\"&M224,I224&\"・\"&J224&\"・\"&K224&\"・\"&L224&\"・\"&M224&\"・\"&N224))))))","v":""},"","","","",""]
[null,{"$f":"データリスト!P$46","v":"分会大会"},{"$f":"IF(データリスト!$P63=\"\",\"\",データリスト!$P63)","v":""},{"$nulls":17},{"$f":"IF(I225:N225=\"\",\"\",IF(J225:N225=\"\",I225,IF(K225:N225=\"\",I225&\"・\"&J225,IF(L225:N225=\"\",I225&\"・\"&J225&\"・\"&K225,IF(M225:N225=\"\",I225&\"・\"&J225&\"・\"&K225&\"・\"&L225,IF(N225=\"\",I225&\"・\"&J225&\"・\"&K225&\"・\"&L225&\"・\"&M225,I225&\"・\"&J225&\"・\"&K225&\"・\"&L225&\"・\"&M225&\"・\"&N225))))))","v":""},"","","","",""]
[null,{"$f":"データリスト!P$46","v":"分会大会"},{"$f":"IF(データリスト!$P64=\"\",\"\",データリスト!$P64)","v":""},{"$nulls":17},{"$f":"IF(I226:N226=\"\",\"\",IF(J226:N226=\"\",I226,IF(K226:N226=\"\",I226&\"・\"&J226,IF(L226:N226=\"\",I226&\"・\"&J226&\"・\"&K226,IF(M226:N226=\"\",I226&\"・\"&J226&\"・\"&K226&\"・\"&L226,IF(N226=\"\",I226&\"・\"&J226&\"・\"&K226&\"・\"&L226&\"・\"&M226,I226&\"・\"&J226&\"・\"&K226&\"・\"&L226&\"・\"&M226&\"・\"&N226))))))","v":""},"","","","",""]
[null,{"$f":"データリスト!P$46","v":"分会大会"},{"$f":"IF(データリスト!$P65=\"\",\"\",データリスト!$P65)","v":""},{"$nulls":17},{"$f":"IF(I227:N227=\"\",\"\",IF(J227:N227=\"\",I227,IF(K227:N227=\"\",I227&\"・\"&J227,IF(L227:N227=\"\",I227&\"・\"&J227&\"・\"&K227,IF(M227:N227=\"\",I227&\"・\"&J227&\"・\"&K227&\"・\"&L227,IF(N227=\"\",I227&\"・\"&J227&\"・\"&K227&\"・\"&L227&\"・\"&M227,I227&\"・\"&J227&\"・\"&K227&\"・\"&L227&\"・\"&M227&\"・\"&N227))))))","v":""},"","","","",""]
[null,{"$f":"データリスト!P$46","v":"分会大会"},{"$f":"IF(データリスト!$P66=\"\",\"\",データリスト!$P66)","v":""},{"$nulls":17},{"$f":"IF(I228:N228=\"\",\"\",IF(J228:N228=\"\",I228,IF(K228:N228=\"\",I228&\"・\"&J228,IF(L228:N228=\"\",I228&\"・\"&J228&\"・\"&K228,IF(M228:N228=\"\",I228&\"・\"&J228&\"・\"&K228&\"・\"&L228,IF(N228=\"\",I228&\"・\"&J228&\"・\"&K228&\"・\"&L228&\"・\"&M228,I228&\"・\"&J228&\"・\"&K228&\"・\"&L228&\"・\"&M228&\"・\"&N228))))))","v":""},"","","","",""]
[null,{"$f":"データリスト!Q$46","v":"分会執行委員会"},{"$f":"IF(データリスト!$Q47=\"\",\"\",データリスト!$Q47)","v":"計画・周知"},{"$nulls":17},{"$f":"IF(I229:N229=\"\",\"\",IF(J229:N229=\"\",I229,IF(K229:N229=\"\",I229&\"・\"&J229,IF(L229:N229=\"\",I229&\"・\"&J229&\"・\"&K229,IF(M229:N229=\"\",I229&\"・\"&J229&\"・\"&K229&\"・\"&L229,IF(N229=\"\",I229&\"・\"&J229&\"・\"&K229&\"・\"&L229&\"・\"&M229,I229&\"・\"&J229&\"・\"&K229&\"・\"&L229&\"・\"&M229&\"・\"&N229))))))","v":""},"","","","",""]
[null,{"$f":"データリスト!Q$46","v":"分会執行委員会"},{"$f":"IF(データリスト!$Q48=\"\",\"\",データリスト!$Q48)","v":"資料作成"},{"$nulls":17},{"$f":"IF(I230:N230=\"\",\"\",IF(J230:N230=\"\",I230,IF(K230:N230=\"\",I230&\"・\"&J230,IF(L230:N230=\"\",I230&\"・\"&J230&\"・\"&K230,IF(M230:N230=\"\",I230&\"・\"&J230&\"・\"&K230&\"・\"&L230,IF(N230=\"\",I230&\"・\"&J230&\"・\"&K230&\"・\"&L230&\"・\"&M230,I230&\"・\"&J230&\"・\"&K230&\"・\"&L230&\"・\"&M230&\"・\"&N230))))))","v":""},"","","","",""]
[null,{"$f":"データリスト!Q$46","v":"分会執行委員会"},{"$f":"IF(データリスト!$Q49=\"\",\"\",データリスト!$Q49)","v":"買い出し(必要に応じて)"},{"$nulls":17},{"$f":"IF(I231:N231=\"\",\"\",IF(J231:N231=\"\",I231,IF(K231:N231=\"\",I231&\"・\"&J231,IF(L231:N231=\"\",I231&\"・\"&J231&\"・\"&K231,IF(M231:N231=\"\",I231&\"・\"&J231&\"・\"&K231&\"・\"&L231,IF(N231=\"\",I231&\"・\"&J231&\"・\"&K231&\"・\"&L231&\"・\"&M231,I231&\"・\"&J231&\"・\"&K231&\"・\"&L231&\"・\"&M231&\"・\"&N231))))))","v":""},"","","","",""]
[null,{"$f":"データリスト!Q$46","v":"分会執行委員会"},{"$f":"IF(データリスト!$Q50=\"\",\"\",データリスト!$Q50)","v":"執行委員会開催"},{"$nulls":17},{"$f":"IF(I232:N232=\"\",\"\",IF(J232:N232=\"\",I232,IF(K232:N232=\"\",I232&\"・\"&J232,IF(L232:N232=\"\",I232&\"・\"&J232&\"・\"&K232,IF(M232:N232=\"\",I232&\"・\"&J232&\"・\"&K232&\"・\"&L232,IF(N232=\"\",I232&\"・\"&J232&\"・\"&K232&\"・\"&L232&\"・\"&M232,I232&\"・\"&J232&\"・\"&K232&\"・\"&L232&\"・\"&M232&\"・\"&N232))))))","v":""},"","","","",""]
[null,{"$f":"データリスト!Q$46","v":"分会執行委員会"},{"$f":"IF(データリスト!$Q51=\"\",\"\",データリスト!$Q51)","v":"議事録の作成"},{"$nulls":17},{"$f":"IF(I233:N233=\"\",\"\",IF(J233:N233=\"\",I233,IF(K233:N233=\"\",I233&\"・\"&J233,IF(L233:N233=\"\",I233&\"・\"&J233&\"・\"&K233,IF(M233:N233=\"\",I233&\"・\"&J233&\"・\"&K233&\"・\"&L233,IF(N233=\"\",I233&\"・\"&J233&\"・\"&K233&\"・\"&L233&\"・\"&M233,I233&\"・\"&J233&\"・\"&K233&\"・\"&L233&\"・\"&M233&\"・\"&N233))))))","v":""},"","","","",""]
[null,{"$f":"データリスト!Q$46","v":"分会執行委員会"},{"$f":"IF(データリスト!$Q52=\"\",\"\",データリスト!$Q52)","v":"会計確認"},{"$nulls":17},{"$f":"IF(I234:N234=\"\",\"\",IF(J234:N234=\"\",I234,IF(K234:N234=\"\",I234&\"・\"&J234,IF(L234:N234=\"\",I234&\"・\"&J234&\"・\"&K234,IF(M234:N234=\"\",I234&\"・\"&J234&\"・\"&K234&\"・\"&L234,IF(N234=\"\",I234&\"・\"&J234&\"・\"&K234&\"・\"&L234&\"・\"&M234,I234&\"・\"&J234&\"・\"&K234&\"・\"&L234&\"・\"&M234&\"・\"&N234))))))","v":""},"","","","",""]
[null,{"$f":"データリスト!Q$46","v":"分会執行委員会"},{"$f":"IF(データリスト!$Q53=\"\",\"\",データリスト!$Q53)","v":""},{"$nulls":17},{"$f":"IF(I235:N235=\"\",\"\",IF(J235:N235=\"\",I235,IF(K235:N235=\"\",I235&\"・\"&J235,IF(L235:N235=\"\",I235&\"・\"&J235&\"・\"&K235,IF(M235:N235=\"\",I235&\"・\"&J235&\"・\"&K235&\"・\"&L235,IF(N235=\"\",I235&\"・\"&J235&\"・\"&K235&\"・\"&L235&\"・\"&M235,I235&\"・\"&J235&\"・\"&K235&\"・\"&L235&\"・\"&M235&\"・\"&N235))))))","v":""},"","","","",""]
[null,{"$f":"データリスト!Q$46","v":"分会執行委員会"},{"$f":"IF(データリスト!$Q54=\"\",\"\",データリスト!$Q54)","v":""},{"$nulls":17},{"$f":"IF(I236:N236=\"\",\"\",IF(J236:N236=\"\",I236,IF(K236:N236=\"\",I236&\"・\"&J236,IF(L236:N236=\"\",I236&\"・\"&J236&\"・\"&K236,IF(M236:N236=\"\",I236&\"・\"&J236&\"・\"&K236&\"・\"&L236,IF(N236=\"\",I236&\"・\"&J236&\"・\"&K236&\"・\"&L236&\"・\"&M236,I236&\"・\"&J236&\"・\"&K236&\"・\"&L236&\"・\"&M236&\"・\"&N236))))))","v":""},"","","","",""]
[null,{"$f":"データリスト!Q$46","v":"分会執行委員会"},{"$f":"IF(データリスト!$Q55=\"\",\"\",データリスト!$Q55)","v":""},{"$nulls":17},{"$f":"IF(I237:N237=\"\",\"\",IF(J237:N237=\"\",I237,IF(K237:N237=\"\",I237&\"・\"&J237,IF(L237:N237=\"\",I237&\"・\"&J237&\"・\"&K237,IF(M237:N237=\"\",I237&\"・\"&J237&\"・\"&K237&\"・\"&L237,IF(N237=\"\",I237&\"・\"&J237&\"・\"&K237&\"・\"&L237&\"・\"&M237,I237&\"・\"&J237&\"・\"&K237&\"・\"&L237&\"・\"&M237&\"・\"&N237))))))","v":""},"","","","",""]
[null,{"$f":"データリスト!Q$46","v":"分会執行委員会"},{"$f":"IF(データリスト!$Q56=\"\",\"\",データリスト!$Q56)","v":""},{"$nulls":17},{"$f":"IF(I238:N238=\"\",\"\",IF(J238:N238=\"\",I238,IF(K238:N238=\"\",I238&\"・\"&J238,IF(L238:N238=\"\",I238&\"・\"&J238&\"・\"&K238,IF(M238:N238=\"\",I238&\"・\"&J238&\"・\"&K238&\"・\"&L238,IF(N238=\"\",I238&\"・\"&J238&\"・\"&K238&\"・\"&L238&\"・\"&M238,I238&\"・\"&J238&\"・\"&K238&\"・\"&L238&\"・\"&M238&\"・\"&N238))))))","v":""},"","","","",""]
[null,{"$f":"データリスト!Q$46","v":"分会執行委員会"},{"$f":"IF(データリスト!$Q57=\"\",\"\",データリスト!$Q57)","v":""},{"$nulls":17},{"$f":"IF(I239:N239=\"\",\"\",IF(J239:N239=\"\",I239,IF(K239:N239=\"\",I239&\"・\"&J239,IF(L239:N239=\"\",I239&\"・\"&J239&\"・\"&K239,IF(M239:N239=\"\",I239&\"・\"&J239&\"・\"&K239&\"・\"&L239,IF(N239=\"\",I239&\"・\"&J239&\"・\"&K239&\"・\"&L239&\"・\"&M239,I239&\"・\"&J239&\"・\"&K239&\"・\"&L239&\"・\"&M239&\"・\"&N239))))))","v":""},"","","","",""]
[null,{"$f":"データリスト!Q$46","v":"分会執行委員会"},{"$f":"IF(データリスト!$Q58=\"\",\"\",データリスト!$Q58)","v":""},{"$nulls":17},{"$f":"IF(I240:N240=\"\",\"\",IF(J240:N240=\"\",I240,IF(K240:N240=\"\",I240&\"・\"&J240,IF(L240:N240=\"\",I240&\"・\"&J240&\"・\"&K240,IF(M240:N240=\"\",I240&\"・\"&J240&\"・\"&K240&\"・\"&L240,IF(N240=\"\",I240&\"・\"&J240&\"・\"&K240&\"・\"&L240&\"・\"&M240,I240&\"・\"&J240&\"・\"&K240&\"・\"&L240&\"・\"&M240&\"・\"&N240))))))","v":""},"","","","",""]
[null,{"$f":"データリスト!Q$46","v":"分会執行委員会"},{"$f":"IF(データリスト!$Q59=\"\",\"\",データリスト!$Q59)","v":""},{"$nulls":17},{"$f":"IF(I241:N241=\"\",\"\",IF(J241:N241=\"\",I241,IF(K241:N241=\"\",I241&\"・\"&J241,IF(L241:N241=\"\",I241&\"・\"&J241&\"・\"&K241,IF(M241:N241=\"\",I241&\"・\"&J241&\"・\"&K241&\"・\"&L241,IF(N241=\"\",I241&\"・\"&J241&\"・\"&K241&\"・\"&L241&\"・\"&M241,I241&\"・\"&J241&\"・\"&K241&\"・\"&L241&\"・\"&M241&\"・\"&N241))))))","v":""},"","","","",""]
[null,{"$f":"データリスト!Q$46","v":"分会執行委員会"},{"$f":"IF(データリスト!$Q60=\"\",\"\",データリスト!$Q60)","v":""},{"$nulls":17},{"$f":"IF(I242:N242=\"\",\"\",IF(J242:N242=\"\",I242,IF(K242:N242=\"\",I242&\"・\"&J242,IF(L242:N242=\"\",I242&\"・\"&J242&\"・\"&K242,IF(M242:N242=\"\",I242&\"・\"&J242&\"・\"&K242&\"・\"&L242,IF(N242=\"\",I242&\"・\"&J242&\"・\"&K242&\"・\"&L242&\"・\"&M242,I242&\"・\"&J242&\"・\"&K242&\"・\"&L242&\"・\"&M242&\"・\"&N242))))))","v":""},"","","","",""]
[null,{"$f":"データリスト!Q$46","v":"分会執行委員会"},{"$f":"IF(データリスト!$Q61=\"\",\"\",データリスト!$Q61)","v":""},{"$nulls":17},{"$f":"IF(I243:N243=\"\",\"\",IF(J243:N243=\"\",I243,IF(K243:N243=\"\",I243&\"・\"&J243,IF(L243:N243=\"\",I243&\"・\"&J243&\"・\"&K243,IF(M243:N243=\"\",I243&\"・\"&J243&\"・\"&K243&\"・\"&L243,IF(N243=\"\",I243&\"・\"&J243&\"・\"&K243&\"・\"&L243&\"・\"&M243,I243&\"・\"&J243&\"・\"&K243&\"・\"&L243&\"・\"&M243&\"・\"&N243))))))","v":""},"","","","",""]
[null,{"$f":"データリスト!Q$46","v":"分会執行委員会"},{"$f":"IF(データリスト!$Q62=\"\",\"\",データリスト!$Q62)","v":""},{"$nulls":17},{"$f":"IF(I244:N244=\"\",\"\",IF(J244:N244=\"\",I244,IF(K244:N244=\"\",I244&\"・\"&J244,IF(L244:N244=\"\",I244&\"・\"&J244&\"・\"&K244,IF(M244:N244=\"\",I244&\"・\"&J244&\"・\"&K244&\"・\"&L244,IF(N244=\"\",I244&\"・\"&J244&\"・\"&K244&\"・\"&L244&\"・\"&M244,I244&\"・\"&J244&\"・\"&K244&\"・\"&L244&\"・\"&M244&\"・\"&N244))))))","v":""},"","","","",""]
[null,{"$f":"データリスト!Q$46","v":"分会執行委員会"},{"$f":"IF(データリスト!$Q63=\"\",\"\",データリスト!$Q63)","v":""},{"$nulls":17},{"$f":"IF(I245:N245=\"\",\"\",IF(J245:N245=\"\",I245,IF(K245:N245=\"\",I245&\"・\"&J245,IF(L245:N245=\"\",I245&\"・\"&J245&\"・\"&K245,IF(M245:N245=\"\",I245&\"・\"&J245&\"・\"&K245&\"・\"&L245,IF(N245=\"\",I245&\"・\"&J245&\"・\"&K245&\"・\"&L245&\"・\"&M245,I245&\"・\"&J245&\"・\"&K245&\"・\"&L245&\"・\"&M245&\"・\"&N245))))))","v":""},"","","","",""]
[null,{"$f":"データリスト!Q$46","v":"分会執行委員会"},{"$f":"IF(データリスト!$Q64=\"\",\"\",データリスト!$Q64)","v":""},{"$nulls":17},{"$f":"IF(I246:N246=\"\",\"\",IF(J246:N246=\"\",I246,IF(K246:N246=\"\",I246&\"・\"&J246,IF(L246:N246=\"\",I246&\"・\"&J246&\"・\"&K246,IF(M246:N246=\"\",I246&\"・\"&J246&\"・\"&K246&\"・\"&L246,IF(N246=\"\",I246&\"・\"&J246&\"・\"&K246&\"・\"&L246&\"・\"&M246,I246&\"・\"&J246&\"・\"&K246&\"・\"&L246&\"・\"&M246&\"・\"&N246))))))","v":""},"","","","",""]
[null,{"$f":"データリスト!Q$46","v":"分会執行委員会"},{"$f":"IF(データリスト!$Q65=\"\",\"\",データリスト!$Q65)","v":""},{"$nulls":17},{"$f":"IF(I247:N247=\"\",\"\",IF(J247:N247=\"\",I247,IF(K247:N247=\"\",I247&\"・\"&J247,IF(L247:N247=\"\",I247&\"・\"&J247&\"・\"&K247,IF(M247:N247=\"\",I247&\"・\"&J247&\"・\"&K247&\"・\"&L247,IF(N247=\"\",I247&\"・\"&J247&\"・\"&K247&\"・\"&L247&\"・\"&M247,I247&\"・\"&J247&\"・\"&K247&\"・\"&L247&\"・\"&M247&\"・\"&N247))))))","v":""},"","","","",""]
[null,{"$f":"データリスト!Q$46","v":"分会執行委員会"},{"$f":"IF(データリスト!$Q66=\"\",\"\",データリスト!$Q66)","v":""},{"$nulls":17},{"$f":"IF(I248:N248=\"\",\"\",IF(J248:N248=\"\",I248,IF(K248:N248=\"\",I248&\"・\"&J248,IF(L248:N248=\"\",I248&\"・\"&J248&\"・\"&K248,IF(M248:N248=\"\",I248&\"・\"&J248&\"・\"&K248&\"・\"&L248,IF(N248=\"\",I248&\"・\"&J248&\"・\"&K248&\"・\"&L248&\"・\"&M248,I248&\"・\"&J248&\"・\"&K248&\"・\"&L248&\"・\"&M248&\"・\"&N248))))))","v":""},"","","","",""]
[null,{"$f":"データリスト!R$46","v":"分会集会"},{"$f":"IF(データリスト!$R47=\"\",\"\",データリスト!$R47)","v":"計画・日程調整"},{"$nulls":17},{"$f":"IF(I249:N249=\"\",\"\",IF(J249:N249=\"\",I249,IF(K249:N249=\"\",I249&\"・\"&J249,IF(L249:N249=\"\",I249&\"・\"&J249&\"・\"&K249,IF(M249:N249=\"\",I249&\"・\"&J249&\"・\"&K249&\"・\"&L249,IF(N249=\"\",I249&\"・\"&J249&\"・\"&K249&\"・\"&L249&\"・\"&M249,I249&\"・\"&J249&\"・\"&K249&\"・\"&L249&\"・\"&M249&\"・\"&N249))))))","v":""},"","","","",""]
[null,{"$f":"データリスト!R$46","v":"分会集会"},{"$f":"IF(データリスト!$R48=\"\",\"\",データリスト!$R48)","v":"周知(職場・会社依頼)"},{"$nulls":17},{"$f":"IF(I250:N250=\"\",\"\",IF(J250:N250=\"\",I250,IF(K250:N250=\"\",I250&\"・\"&J250,IF(L250:N250=\"\",I250&\"・\"&J250&\"・\"&K250,IF(M250:N250=\"\",I250&\"・\"&J250&\"・\"&K250&\"・\"&L250,IF(N250=\"\",I250&\"・\"&J250&\"・\"&K250&\"・\"&L250&\"・\"&M250,I250&\"・\"&J250&\"・\"&K250&\"・\"&L250&\"・\"&M250&\"・\"&N250))))))","v":""},"","","","",""]
[null,{"$f":"データリスト!R$46","v":"分会集会"},{"$f":"IF(データリスト!$R49=\"\",\"\",データリスト!$R49)","v":"事前準備(資料作成)"},{"$nulls":17},{"$f":"IF(I251:N251=\"\",\"\",IF(J251:N251=\"\",I251,IF(K251:N251=\"\",I251&\"・\"&J251,IF(L251:N251=\"\",I251&\"・\"&J251&\"・\"&K251,IF(M251:N251=\"\",I251&\"・\"&J251&\"・\"&K251&\"・\"&L251,IF(N251=\"\",I251&\"・\"&J251&\"・\"&K251&\"・\"&L251&\"・\"&M251,I251&\"・\"&J251&\"・\"&K251&\"・\"&L251&\"・\"&M251&\"・\"&N251))))))","v":""},"","","","",""]
[null,{"$f":"データリスト!R$46","v":"分会集会"},{"$f":"IF(データリスト!$R50=\"\",\"\",データリスト!$R50)","v":"事前準備(会場設営)"},{"$nulls":17},{"$f":"IF(I252:N252=\"\",\"\",IF(J252:N252=\"\",I252,IF(K252:N252=\"\",I252&\"・\"&J252,IF(L252:N252=\"\",I252&\"・\"&J252&\"・\"&K252,IF(M252:N252=\"\",I252&\"・\"&J252&\"・\"&K252&\"・\"&L252,IF(N252=\"\",I252&\"・\"&J252&\"・\"&K252&\"・\"&L252&\"・\"&M252,I252&\"・\"&J252&\"・\"&K252&\"・\"&L252&\"・\"&M252&\"・\"&N252))))))","v":""},"","","","",""]
[null,{"$f":"データリスト!R$46","v":"分会集会"},{"$f":"IF(データリスト!$R51=\"\",\"\",データリスト!$R51)","v":"事前準備(買い出し)"},{"$nulls":17},{"$f":"IF(I253:N253=\"\",\"\",IF(J253:N253=\"\",I253,IF(K253:N253=\"\",I253&\"・\"&J253,IF(L253:N253=\"\",I253&\"・\"&J253&\"・\"&K253,IF(M253:N253=\"\",I253&\"・\"&J253&\"・\"&K253&\"・\"&L253,IF(N253=\"\",I253&\"・\"&J253&\"・\"&K253&\"・\"&L253&\"・\"&M253,I253&\"・\"&J253&\"・\"&K253&\"・\"&L253&\"・\"&M253&\"・\"&N253))))))","v":""},"","","","",""]
[null,{"$f":"データリスト!R$46","v":"分会集会"},{"$f":"IF(データリスト!$R52=\"\",\"\",データリスト!$R52)","v":"《分会集会開催》"},{"$nulls":17},{"$f":"IF(I254:N254=\"\",\"\",IF(J254:N254=\"\",I254,IF(K254:N254=\"\",I254&\"・\"&J254,IF(L254:N254=\"\",I254&\"・\"&J254&\"・\"&K254,IF(M254:N254=\"\",I254&\"・\"&J254&\"・\"&K254&\"・\"&L254,IF(N254=\"\",I254&\"・\"&J254&\"・\"&K254&\"・\"&L254&\"・\"&M254,I254&\"・\"&J254&\"・\"&K254&\"・\"&L254&\"・\"&M254&\"・\"&N254))))))","v":""},"","","","",""]
[null,{"$f":"データリスト!R$46","v":"分会集会"},{"$f":"IF(データリスト!$R53=\"\",\"\",データリスト!$R53)","v":"議長・司会進行"},{"$nulls":17},{"$f":"IF(I255:N255=\"\",\"\",IF(J255:N255=\"\",I255,IF(K255:N255=\"\",I255&\"・\"&J255,IF(L255:N255=\"\",I255&\"・\"&J255&\"・\"&K255,IF(M255:N255=\"\",I255&\"・\"&J255&\"・\"&K255&\"・\"&L255,IF(N255=\"\",I255&\"・\"&J255&\"・\"&K255&\"・\"&L255&\"・\"&M255,I255&\"・\"&J255&\"・\"&K255&\"・\"&L255&\"・\"&M255&\"・\"&N255))))))","v":""},"","","","",""]
[null,{"$f":"データリスト!R$46","v":"分会集会"},{"$f":"IF(データリスト!$R54=\"\",\"\",データリスト!$R54)","v":"意見集約"},{"$nulls":17},{"$f":"IF(I256:N256=\"\",\"\",IF(J256:N256=\"\",I256,IF(K256:N256=\"\",I256&\"・\"&J256,IF(L256:N256=\"\",I256&\"・\"&J256&\"・\"&K256,IF(M256:N256=\"\",I256&\"・\"&J256&\"・\"&K256&\"・\"&L256,IF(N256=\"\",I256&\"・\"&J256&\"・\"&K256&\"・\"&L256&\"・\"&M256,I256&\"・\"&J256&\"・\"&K256&\"・\"&L256&\"・\"&M256&\"・\"&N256))))))","v":""},"","","","",""]
[null,{"$f":"データリスト!R$46","v":"分会集会"},{"$f":"IF(データリスト!$R55=\"\",\"\",データリスト!$R55)","v":""},{"$nulls":17},{"$f":"IF(I257:N257=\"\",\"\",IF(J257:N257=\"\",I257,IF(K257:N257=\"\",I257&\"・\"&J257,IF(L257:N257=\"\",I257&\"・\"&J257&\"・\"&K257,IF(M257:N257=\"\",I257&\"・\"&J257&\"・\"&K257&\"・\"&L257,IF(N257=\"\",I257&\"・\"&J257&\"・\"&K257&\"・\"&L257&\"・\"&M257,I257&\"・\"&J257&\"・\"&K257&\"・\"&L257&\"・\"&M257&\"・\"&N257))))))","v":""},"","","","",""]
[null,{"$f":"データリスト!R$46","v":"分会集会"},{"$f":"IF(データリスト!$R56=\"\",\"\",データリスト!$R56)","v":""},{"$nulls":17},{"$f":"IF(I258:N258=\"\",\"\",IF(J258:N258=\"\",I258,IF(K258:N258=\"\",I258&\"・\"&J258,IF(L258:N258=\"\",I258&\"・\"&J258&\"・\"&K258,IF(M258:N258=\"\",I258&\"・\"&J258&\"・\"&K258&\"・\"&L258,IF(N258=\"\",I258&\"・\"&J258&\"・\"&K258&\"・\"&L258&\"・\"&M258,I258&\"・\"&J258&\"・\"&K258&\"・\"&L258&\"・\"&M258&\"・\"&N258))))))","v":""},"","","","",""]
[null,{"$f":"データリスト!R$46","v":"分会集会"},{"$f":"IF(データリスト!$R57=\"\",\"\",データリスト!$R57)","v":""},{"$nulls":17},{"$f":"IF(I259:N259=\"\",\"\",IF(J259:N259=\"\",I259,IF(K259:N259=\"\",I259&\"・\"&J259,IF(L259:N259=\"\",I259&\"・\"&J259&\"・\"&K259,IF(M259:N259=\"\",I259&\"・\"&J259&\"・\"&K259&\"・\"&L259,IF(N259=\"\",I259&\"・\"&J259&\"・\"&K259&\"・\"&L259&\"・\"&M259,I259&\"・\"&J259&\"・\"&K259&\"・\"&L259&\"・\"&M259&\"・\"&N259))))))","v":""},"","","","",""]
[null,{"$f":"データリスト!R$46","v":"分会集会"},{"$f":"IF(データリスト!$R58=\"\",\"\",データリスト!$R58)","v":""},{"$nulls":17},{"$f":"IF(I260:N260=\"\",\"\",IF(J260:N260=\"\",I260,IF(K260:N260=\"\",I260&\"・\"&J260,IF(L260:N260=\"\",I260&\"・\"&J260&\"・\"&K260,IF(M260:N260=\"\",I260&\"・\"&J260&\"・\"&K260&\"・\"&L260,IF(N260=\"\",I260&\"・\"&J260&\"・\"&K260&\"・\"&L260&\"・\"&M260,I260&\"・\"&J260&\"・\"&K260&\"・\"&L260&\"・\"&M260&\"・\"&N260))))))","v":""},"","","","",""]
[null,{"$f":"データリスト!R$46","v":"分会集会"},{"$f":"IF(データリスト!$R59=\"\",\"\",データリスト!$R59)","v":""},{"$nulls":17},{"$f":"IF(I261:N261=\"\",\"\",IF(J261:N261=\"\",I261,IF(K261:N261=\"\",I261&\"・\"&J261,IF(L261:N261=\"\",I261&\"・\"&J261&\"・\"&K261,IF(M261:N261=\"\",I261&\"・\"&J261&\"・\"&K261&\"・\"&L261,IF(N261=\"\",I261&\"・\"&J261&\"・\"&K261&\"・\"&L261&\"・\"&M261,I261&\"・\"&J261&\"・\"&K261&\"・\"&L261&\"・\"&M261&\"・\"&N261))))))","v":""},"","","","",""]
[null,{"$f":"データリスト!R$46","v":"分会集会"},{"$f":"IF(データリスト!$R60=\"\",\"\",データリスト!$R60)","v":""},{"$nulls":17},{"$f":"IF(I262:N262=\"\",\"\",IF(J262:N262=\"\",I262,IF(K262:N262=\"\",I262&\"・\"&J262,IF(L262:N262=\"\",I262&\"・\"&J262&\"・\"&K262,IF(M262:N262=\"\",I262&\"・\"&J262&\"・\"&K262&\"・\"&L262,IF(N262=\"\",I262&\"・\"&J262&\"・\"&K262&\"・\"&L262&\"・\"&M262,I262&\"・\"&J262&\"・\"&K262&\"・\"&L262&\"・\"&M262&\"・\"&N262))))))","v":""},"","","","",""]
[null,{"$f":"データリスト!R$46","v":"分会集会"},{"$f":"IF(データリスト!$R61=\"\",\"\",データリスト!$R61)","v":""},{"$nulls":17},{"$f":"IF(I263:N263=\"\",\"\",IF(J263:N263=\"\",I263,IF(K263:N263=\"\",I263&\"・\"&J263,IF(L263:N263=\"\",I263&\"・\"&J263&\"・\"&K263,IF(M263:N263=\"\",I263&\"・\"&J263&\"・\"&K263&\"・\"&L263,IF(N263=\"\",I263&\"・\"&J263&\"・\"&K263&\"・\"&L263&\"・\"&M263,I263&\"・\"&J263&\"・\"&K263&\"・\"&L263&\"・\"&M263&\"・\"&N263))))))","v":""},"","","","",""]
[null,{"$f":"データリスト!R$46","v":"分会集会"},{"$f":"IF(データリスト!$R62=\"\",\"\",データリスト!$R62)","v":""},{"$nulls":17},{"$f":"IF(I264:N264=\"\",\"\",IF(J264:N264=\"\",I264,IF(K264:N264=\"\",I264&\"・\"&J264,IF(L264:N264=\"\",I264&\"・\"&J264&\"・\"&K264,IF(M264:N264=\"\",I264&\"・\"&J264&\"・\"&K264&\"・\"&L264,IF(N264=\"\",I264&\"・\"&J264&\"・\"&K264&\"・\"&L264&\"・\"&M264,I264&\"・\"&J264&\"・\"&K264&\"・\"&L264&\"・\"&M264&\"・\"&N264))))))","v":""},"","","","",""]
[null,{"$f":"データリスト!R$46","v":"分会集会"},{"$f":"IF(データリスト!$R63=\"\",\"\",データリスト!$R63)","v":""},{"$nulls":17},{"$f":"IF(I265:N265=\"\",\"\",IF(J265:N265=\"\",I265,IF(K265:N265=\"\",I265&\"・\"&J265,IF(L265:N265=\"\",I265&\"・\"&J265&\"・\"&K265,IF(M265:N265=\"\",I265&\"・\"&J265&\"・\"&K265&\"・\"&L265,IF(N265=\"\",I265&\"・\"&J265&\"・\"&K265&\"・\"&L265&\"・\"&M265,I265&\"・\"&J265&\"・\"&K265&\"・\"&L265&\"・\"&M265&\"・\"&N265))))))","v":""},"","","","",""]
[null,{"$f":"データリスト!R$46","v":"分会集会"},{"$f":"IF(データリスト!$R64=\"\",\"\",データリスト!$R64)","v":""},{"$nulls":17},{"$f":"IF(I266:N266=\"\",\"\",IF(J266:N266=\"\",I266,IF(K266:N266=\"\",I266&\"・\"&J266,IF(L266:N266=\"\",I266&\"・\"&J266&\"・\"&K266,IF(M266:N266=\"\",I266&\"・\"&J266&\"・\"&K266&\"・\"&L266,IF(N266=\"\",I266&\"・\"&J266&\"・\"&K266&\"・\"&L266&\"・\"&M266,I266&\"・\"&J266&\"・\"&K266&\"・\"&L266&\"・\"&M266&\"・\"&N266))))))","v":""},"","","","",""]
[null,{"$f":"データリスト!R$46","v":"分会集会"},{"$f":"IF(データリスト!$R65=\"\",\"\",データリスト!$R65)","v":""},{"$nulls":17},{"$f":"IF(I267:N267=\"\",\"\",IF(J267:N267=\"\",I267,IF(K267:N267=\"\",I267&\"・\"&J267,IF(L267:N267=\"\",I267&\"・\"&J267&\"・\"&K267,IF(M267:N267=\"\",I267&\"・\"&J267&\"・\"&K267&\"・\"&L267,IF(N267=\"\",I267&\"・\"&J267&\"・\"&K267&\"・\"&L267&\"・\"&M267,I267&\"・\"&J267&\"・\"&K267&\"・\"&L267&\"・\"&M267&\"・\"&N267))))))","v":""},"","","","",""]
[null,{"$f":"データリスト!R$46","v":"分会集会"},{"$f":"IF(データリスト!$R66=\"\",\"\",データリスト!$R66)","v":""},{"$nulls":17},{"$f":"IF(I268:N268=\"\",\"\",IF(J268:N268=\"\",I268,IF(K268:N268=\"\",I268&\"・\"&J268,IF(L268:N268=\"\",I268&\"・\"&J268&\"・\"&K268,IF(M268:N268=\"\",I268&\"・\"&J268&\"・\"&K268&\"・\"&L268,IF(N268=\"\",I268&\"・\"&J268&\"・\"&K268&\"・\"&L268&\"・\"&M268,I268&\"・\"&J268&\"・\"&K268&\"・\"&L268&\"・\"&M268&\"・\"&N268))))))","v":""},"","","","",""]
[null,{"$f":"データリスト!S$46","v":"分会青年部総会"},{"$f":"IF(データリスト!$S47=\"\",\"\",データリスト!$S47)","v":"計画・日程調整"},{"$nulls":17},{"$f":"IF(I269:N269=\"\",\"\",IF(J269:N269=\"\",I269,IF(K269:N269=\"\",I269&\"・\"&J269,IF(L269:N269=\"\",I269&\"・\"&J269&\"・\"&K269,IF(M269:N269=\"\",I269&\"・\"&J269&\"・\"&K269&\"・\"&L269,IF(N269=\"\",I269&\"・\"&J269&\"・\"&K269&\"・\"&L269&\"・\"&M269,I269&\"・\"&J269&\"・\"&K269&\"・\"&L269&\"・\"&M269&\"・\"&N269))))))","v":""},"","","","",""]
[null,{"$f":"データリスト!S$46","v":"分会青年部総会"},{"$f":"IF(データリスト!$S48=\"\",\"\",データリスト!$S48)","v":"周知(職場・会社依頼)"},{"$nulls":17},{"$f":"IF(I270:N270=\"\",\"\",IF(J270:N270=\"\",I270,IF(K270:N270=\"\",I270&\"・\"&J270,IF(L270:N270=\"\",I270&\"・\"&J270&\"・\"&K270,IF(M270:N270=\"\",I270&\"・\"&J270&\"・\"&K270&\"・\"&L270,IF(N270=\"\",I270&\"・\"&J270&\"・\"&K270&\"・\"&L270&\"・\"&M270,I270&\"・\"&J270&\"・\"&K270&\"・\"&L270&\"・\"&M270&\"・\"&N270))))))","v":""},"","","","",""]
[null,{"$f":"データリスト!S$46","v":"分会青年部総会"},{"$f":"IF(データリスト!$S49=\"\",\"\",データリスト!$S49)","v":"事前準備(資料作成)"},{"$nulls":17},{"$f":"IF(I271:N271=\"\",\"\",IF(J271:N271=\"\",I271,IF(K271:N271=\"\",I271&\"・\"&J271,IF(L271:N271=\"\",I271&\"・\"&J271&\"・\"&K271,IF(M271:N271=\"\",I271&\"・\"&J271&\"・\"&K271&\"・\"&L271,IF(N271=\"\",I271&\"・\"&J271&\"・\"&K271&\"・\"&L271&\"・\"&M271,I271&\"・\"&J271&\"・\"&K271&\"・\"&L271&\"・\"&M271&\"・\"&N271))))))","v":""},"","","","",""]
[null,{"$f":"データリスト!S$46","v":"分会青年部総会"},{"$f":"IF(データリスト!$S50=\"\",\"\",データリスト!$S50)","v":"事前準備(会場準備)"},{"$nulls":17},{"$f":"IF(I272:N272=\"\",\"\",IF(J272:N272=\"\",I272,IF(K272:N272=\"\",I272&\"・\"&J272,IF(L272:N272=\"\",I272&\"・\"&J272&\"・\"&K272,IF(M272:N272=\"\",I272&\"・\"&J272&\"・\"&K272&\"・\"&L272,IF(N272=\"\",I272&\"・\"&J272&\"・\"&K272&\"・\"&L272&\"・\"&M272,I272&\"・\"&J272&\"・\"&K272&\"・\"&L272&\"・\"&M272&\"・\"&N272))))))","v":""},"","","","",""]
[null,{"$f":"データリスト!S$46","v":"分会青年部総会"},{"$f":"IF(データリスト!$S51=\"\",\"\",データリスト!$S51)","v":"《総会の開催》"},{"$nulls":17},{"$f":"IF(I273:N273=\"\",\"\",IF(J273:N273=\"\",I273,IF(K273:N273=\"\",I273&\"・\"&J273,IF(L273:N273=\"\",I273&\"・\"&J273&\"・\"&K273,IF(M273:N273=\"\",I273&\"・\"&J273&\"・\"&K273&\"・\"&L273,IF(N273=\"\",I273&\"・\"&J273&\"・\"&K273&\"・\"&L273&\"・\"&M273,I273&\"・\"&J273&\"・\"&K273&\"・\"&L273&\"・\"&M273&\"・\"&N273))))))","v":""},"","","","",""]
[null,{"$f":"データリスト!S$46","v":"分会青年部総会"},{"$f":"IF(データリスト!$S52=\"\",\"\",データリスト!$S52)","v":"議長・司会進行"},{"$nulls":17},{"$f":"IF(I274:N274=\"\",\"\",IF(J274:N274=\"\",I274,IF(K274:N274=\"\",I274&\"・\"&J274,IF(L274:N274=\"\",I274&\"・\"&J274&\"・\"&K274,IF(M274:N274=\"\",I274&\"・\"&J274&\"・\"&K274&\"・\"&L274,IF(N274=\"\",I274&\"・\"&J274&\"・\"&K274&\"・\"&L274&\"・\"&M274,I274&\"・\"&J274&\"・\"&K274&\"・\"&L274&\"・\"&M274&\"・\"&N274))))))","v":""},"","","","",""]
[null,{"$f":"データリスト!S$46","v":"分会青年部総会"},{"$f":"IF(データリスト!$S53=\"\",\"\",データリスト!$S53)","v":"意見集約"},{"$nulls":17},{"$f":"IF(I275:N275=\"\",\"\",IF(J275:N275=\"\",I275,IF(K275:N275=\"\",I275&\"・\"&J275,IF(L275:N275=\"\",I275&\"・\"&J275&\"・\"&K275,IF(M275:N275=\"\",I275&\"・\"&J275&\"・\"&K275&\"・\"&L275,IF(N275=\"\",I275&\"・\"&J275&\"・\"&K275&\"・\"&L275&\"・\"&M275,I275&\"・\"&J275&\"・\"&K275&\"・\"&L275&\"・\"&M275&\"・\"&N275))))))","v":""},"","","","",""]
[null,{"$f":"データリスト!S$46","v":"分会青年部総会"},{"$f":"IF(データリスト!$S54=\"\",\"\",データリスト!$S54)","v":"報告(分会へ)"},{"$nulls":17},{"$f":"IF(I276:N276=\"\",\"\",IF(J276:N276=\"\",I276,IF(K276:N276=\"\",I276&\"・\"&J276,IF(L276:N276=\"\",I276&\"・\"&J276&\"・\"&K276,IF(M276:N276=\"\",I276&\"・\"&J276&\"・\"&K276&\"・\"&L276,IF(N276=\"\",I276&\"・\"&J276&\"・\"&K276&\"・\"&L276&\"・\"&M276,I276&\"・\"&J276&\"・\"&K276&\"・\"&L276&\"・\"&M276&\"・\"&N276))))))","v":""},"","","","",""]
[null,{"$f":"データリスト!S$46","v":"分会青年部総会"},{"$f":"IF(データリスト!$S55=\"\",\"\",データリスト!$S55)","v":""},{"$nulls":17},{"$f":"IF(I277:N277=\"\",\"\",IF(J277:N277=\"\",I277,IF(K277:N277=\"\",I277&\"・\"&J277,IF(L277:N277=\"\",I277&\"・\"&J277&\"・\"&K277,IF(M277:N277=\"\",I277&\"・\"&J277&\"・\"&K277&\"・\"&L277,IF(N277=\"\",I277&\"・\"&J277&\"・\"&K277&\"・\"&L277&\"・\"&M277,I277&\"・\"&J277&\"・\"&K277&\"・\"&L277&\"・\"&M277&\"・\"&N277))))))","v":""},"","","","",""]
[null,{"$f":"データリスト!S$46","v":"分会青年部総会"},{"$f":"IF(データリスト!$S56=\"\",\"\",データリスト!$S56)","v":""},{"$nulls":17},{"$f":"IF(I278:N278=\"\",\"\",IF(J278:N278=\"\",I278,IF(K278:N278=\"\",I278&\"・\"&J278,IF(L278:N278=\"\",I278&\"・\"&J278&\"・\"&K278,IF(M278:N278=\"\",I278&\"・\"&J278&\"・\"&K278&\"・\"&L278,IF(N278=\"\",I278&\"・\"&J278&\"・\"&K278&\"・\"&L278&\"・\"&M278,I278&\"・\"&J278&\"・\"&K278&\"・\"&L278&\"・\"&M278&\"・\"&N278))))))","v":""},"","","","",""]
[null,{"$f":"データリスト!S$46","v":"分会青年部総会"},{"$f":"IF(データリスト!$S57=\"\",\"\",データリスト!$S57)","v":""},{"$nulls":17},{"$f":"IF(I279:N279=\"\",\"\",IF(J279:N279=\"\",I279,IF(K279:N279=\"\",I279&\"・\"&J279,IF(L279:N279=\"\",I279&\"・\"&J279&\"・\"&K279,IF(M279:N279=\"\",I279&\"・\"&J279&\"・\"&K279&\"・\"&L279,IF(N279=\"\",I279&\"・\"&J279&\"・\"&K279&\"・\"&L279&\"・\"&M279,I279&\"・\"&J279&\"・\"&K279&\"・\"&L279&\"・\"&M279&\"・\"&N279))))))","v":""},"","","","",""]
[null,{"$f":"データリスト!S$46","v":"分会青年部総会"},{"$f":"IF(データリスト!$S58=\"\",\"\",データリスト!$S58)","v":""},{"$nulls":17},{"$f":"IF(I280:N280=\"\",\"\",IF(J280:N280=\"\",I280,IF(K280:N280=\"\",I280&\"・\"&J280,IF(L280:N280=\"\",I280&\"・\"&J280&\"・\"&K280,IF(M280:N280=\"\",I280&\"・\"&J280&\"・\"&K280&\"・\"&L280,IF(N280=\"\",I280&\"・\"&J280&\"・\"&K280&\"・\"&L280&\"・\"&M280,I280&\"・\"&J280&\"・\"&K280&\"・\"&L280&\"・\"&M280&\"・\"&N280))))))","v":""},"","","","",""]
[null,{"$f":"データリスト!S$46","v":"分会青年部総会"},{"$f":"IF(データリスト!$S59=\"\",\"\",データリスト!$S59)","v":""},{"$nulls":17},{"$f":"IF(I281:N281=\"\",\"\",IF(J281:N281=\"\",I281,IF(K281:N281=\"\",I281&\"・\"&J281,IF(L281:N281=\"\",I281&\"・\"&J281&\"・\"&K281,IF(M281:N281=\"\",I281&\"・\"&J281&\"・\"&K281&\"・\"&L281,IF(N281=\"\",I281&\"・\"&J281&\"・\"&K281&\"・\"&L281&\"・\"&M281,I281&\"・\"&J281&\"・\"&K281&\"・\"&L281&\"・\"&M281&\"・\"&N281))))))","v":""},"","","","",""]
[null,{"$f":"データリスト!S$46","v":"分会青年部総会"},{"$f":"IF(データリスト!$S60=\"\",\"\",データリスト!$S60)","v":""},{"$nulls":17},{"$f":"IF(I282:N282=\"\",\"\",IF(J282:N282=\"\",I282,IF(K282:N282=\"\",I282&\"・\"&J282,IF(L282:N282=\"\",I282&\"・\"&J282&\"・\"&K282,IF(M282:N282=\"\",I282&\"・\"&J282&\"・\"&K282&\"・\"&L282,IF(N282=\"\",I282&\"・\"&J282&\"・\"&K282&\"・\"&L282&\"・\"&M282,I282&\"・\"&J282&\"・\"&K282&\"・\"&L282&\"・\"&M282&\"・\"&N282))))))","v":""},"","","","",""]
[null,{"$f":"データリスト!S$46","v":"分会青年部総会"},{"$f":"IF(データリスト!$S61=\"\",\"\",データリスト!$S61)","v":""},{"$nulls":17},{"$f":"IF(I283:N283=\"\",\"\",IF(J283:N283=\"\",I283,IF(K283:N283=\"\",I283&\"・\"&J283,IF(L283:N283=\"\",I283&\"・\"&J283&\"・\"&K283,IF(M283:N283=\"\",I283&\"・\"&J283&\"・\"&K283&\"・\"&L283,IF(N283=\"\",I283&\"・\"&J283&\"・\"&K283&\"・\"&L283&\"・\"&M283,I283&\"・\"&J283&\"・\"&K283&\"・\"&L283&\"・\"&M283&\"・\"&N283))))))","v":""},"","","","",""]
[null,{"$f":"データリスト!S$46","v":"分会青年部総会"},{"$f":"IF(データリスト!$S62=\"\",\"\",データリスト!$S62)","v":""},{"$nulls":17},{"$f":"IF(I284:N284=\"\",\"\",IF(J284:N284=\"\",I284,IF(K284:N284=\"\",I284&\"・\"&J284,IF(L284:N284=\"\",I284&\"・\"&J284&\"・\"&K284,IF(M284:N284=\"\",I284&\"・\"&J284&\"・\"&K284&\"・\"&L284,IF(N284=\"\",I284&\"・\"&J284&\"・\"&K284&\"・\"&L284&\"・\"&M284,I284&\"・\"&J284&\"・\"&K284&\"・\"&L284&\"・\"&M284&\"・\"&N284))))))","v":""},"","","","",""]
[null,{"$f":"データリスト!S$46","v":"分会青年部総会"},{"$f":"IF(データリスト!$S63=\"\",\"\",データリスト!$S63)","v":""},{"$nulls":17},{"$f":"IF(I285:N285=\"\",\"\",IF(J285:N285=\"\",I285,IF(K285:N285=\"\",I285&\"・\"&J285,IF(L285:N285=\"\",I285&\"・\"&J285&\"・\"&K285,IF(M285:N285=\"\",I285&\"・\"&J285&\"・\"&K285&\"・\"&L285,IF(N285=\"\",I285&\"・\"&J285&\"・\"&K285&\"・\"&L285&\"・\"&M285,I285&\"・\"&J285&\"・\"&K285&\"・\"&L285&\"・\"&M285&\"・\"&N285))))))","v":""},"","","","",""]
[null,{"$f":"データリスト!S$46","v":"分会青年部総会"},{"$f":"IF(データリスト!$S64=\"\",\"\",データリスト!$S64)","v":""},{"$nulls":17},{"$f":"IF(I286:N286=\"\",\"\",IF(J286:N286=\"\",I286,IF(K286:N286=\"\",I286&\"・\"&J286,IF(L286:N286=\"\",I286&\"・\"&J286&\"・\"&K286,IF(M286:N286=\"\",I286&\"・\"&J286&\"・\"&K286&\"・\"&L286,IF(N286=\"\",I286&\"・\"&J286&\"・\"&K286&\"・\"&L286&\"・\"&M286,I286&\"・\"&J286&\"・\"&K286&\"・\"&L286&\"・\"&M286&\"・\"&N286))))))","v":""},"","","","",""]
[null,{"$f":"データリスト!S$46","v":"分会青年部総会"},{"$f":"IF(データリスト!$S65=\"\",\"\",データリスト!$S65)","v":""},{"$nulls":17},{"$f":"IF(I287:N287=\"\",\"\",IF(J287:N287=\"\",I287,IF(K287:N287=\"\",I287&\"・\"&J287,IF(L287:N287=\"\",I287&\"・\"&J287&\"・\"&K287,IF(M287:N287=\"\",I287&\"・\"&J287&\"・\"&K287&\"・\"&L287,IF(N287=\"\",I287&\"・\"&J287&\"・\"&K287&\"・\"&L287&\"・\"&M287,I287&\"・\"&J287&\"・\"&K287&\"・\"&L287&\"・\"&M287&\"・\"&N287))))))","v":""},"","","","",""]
[null,{"$f":"データリスト!S$46","v":"分会青年部総会"},{"$f":"IF(データリスト!$S66=\"\",\"\",データリスト!$S66)","v":""},{"$nulls":17},{"$f":"IF(I288:N288=\"\",\"\",IF(J288:N288=\"\",I288,IF(K288:N288=\"\",I288&\"・\"&J288,IF(L288:N288=\"\",I288&\"・\"&J288&\"・\"&K288,IF(M288:N288=\"\",I288&\"・\"&J288&\"・\"&K288&\"・\"&L288,IF(N288=\"\",I288&\"・\"&J288&\"・\"&K288&\"・\"&L288&\"・\"&M288,I288&\"・\"&J288&\"・\"&K288&\"・\"&L288&\"・\"&M288&\"・\"&N288))))))","v":""},"","","","",""]
[null,{"$f":"データリスト!T$46","v":"分会青年部幹事会"},{"$f":"IF(データリスト!$T47=\"\",\"\",データリスト!$T47)","v":"計画・日程調整"},{"$nulls":17},{"$f":"IF(I289:N289=\"\",\"\",IF(J289:N289=\"\",I289,IF(K289:N289=\"\",I289&\"・\"&J289,IF(L289:N289=\"\",I289&\"・\"&J289&\"・\"&K289,IF(M289:N289=\"\",I289&\"・\"&J289&\"・\"&K289&\"・\"&L289,IF(N289=\"\",I289&\"・\"&J289&\"・\"&K289&\"・\"&L289&\"・\"&M289,I289&\"・\"&J289&\"・\"&K289&\"・\"&L289&\"・\"&M289&\"・\"&N289))))))","v":""},"","","","",""]
[null,{"$f":"データリスト!T$46","v":"分会青年部幹事会"},{"$f":"IF(データリスト!$T48=\"\",\"\",データリスト!$T48)","v":"事前準備(資料作成)"},{"$nulls":17},{"$f":"IF(I290:N290=\"\",\"\",IF(J290:N290=\"\",I290,IF(K290:N290=\"\",I290&\"・\"&J290,IF(L290:N290=\"\",I290&\"・\"&J290&\"・\"&K290,IF(M290:N290=\"\",I290&\"・\"&J290&\"・\"&K290&\"・\"&L290,IF(N290=\"\",I290&\"・\"&J290&\"・\"&K290&\"・\"&L290&\"・\"&M290,I290&\"・\"&J290&\"・\"&K290&\"・\"&L290&\"・\"&M290&\"・\"&N290))))))","v":""},"","","","",""]
[null,{"$f":"データリスト!T$46","v":"分会青年部幹事会"},{"$f":"IF(データリスト!$T49=\"\",\"\",データリスト!$T49)","v":"《幹事会の開催》"},{"$nulls":17},{"$f":"IF(I291:N291=\"\",\"\",IF(J291:N291=\"\",I291,IF(K291:N291=\"\",I291&\"・\"&J291,IF(L291:N291=\"\",I291&\"・\"&J291&\"・\"&K291,IF(M291:N291=\"\",I291&\"・\"&J291&\"・\"&K291&\"・\"&L291,IF(N291=\"\",I291&\"・\"&J291&\"・\"&K291&\"・\"&L291&\"・\"&M291,I291&\"・\"&J291&\"・\"&K291&\"・\"&L291&\"・\"&M291&\"・\"&N291))))))","v":""},"","","","",""]
[null,{"$f":"データリスト!T$46","v":"分会青年部幹事会"},{"$f":"IF(データリスト!$T50=\"\",\"\",データリスト!$T50)","v":"議長・司会進行"},{"$nulls":17},{"$f":"IF(I292:N292=\"\",\"\",IF(J292:N292=\"\",I292,IF(K292:N292=\"\",I292&\"・\"&J292,IF(L292:N292=\"\",I292&\"・\"&J292&\"・\"&K292,IF(M292:N292=\"\",I292&\"・\"&J292&\"・\"&K292&\"・\"&L292,IF(N292=\"\",I292&\"・\"&J292&\"・\"&K292&\"・\"&L292&\"・\"&M292,I292&\"・\"&J292&\"・\"&K292&\"・\"&L292&\"・\"&M292&\"・\"&N292))))))","v":""},"","","","",""]
[null,{"$f":"データリスト!T$46","v":"分会青年部幹事会"},{"$f":"IF(データリスト!$T51=\"\",\"\",データリスト!$T51)","v":"意見集約"},{"$nulls":17},{"$f":"IF(I293:N293=\"\",\"\",IF(J293:N293=\"\",I293,IF(K293:N293=\"\",I293&\"・\"&J293,IF(L293:N293=\"\",I293&\"・\"&J293&\"・\"&K293,IF(M293:N293=\"\",I293&\"・\"&J293&\"・\"&K293&\"・\"&L293,IF(N293=\"\",I293&\"・\"&J293&\"・\"&K293&\"・\"&L293&\"・\"&M293,I293&\"・\"&J293&\"・\"&K293&\"・\"&L293&\"・\"&M293&\"・\"&N293))))))","v":""},"","","","",""]
[null,{"$f":"データリスト!T$46","v":"分会青年部幹事会"},{"$f":"IF(データリスト!$T52=\"\",\"\",データリスト!$T52)","v":"職場周知"},{"$nulls":17},{"$f":"IF(I294:N294=\"\",\"\",IF(J294:N294=\"\",I294,IF(K294:N294=\"\",I294&\"・\"&J294,IF(L294:N294=\"\",I294&\"・\"&J294&\"・\"&K294,IF(M294:N294=\"\",I294&\"・\"&J294&\"・\"&K294&\"・\"&L294,IF(N294=\"\",I294&\"・\"&J294&\"・\"&K294&\"・\"&L294&\"・\"&M294,I294&\"・\"&J294&\"・\"&K294&\"・\"&L294&\"・\"&M294&\"・\"&N294))))))","v":""},"","","","",""]
[null,{"$f":"データリスト!T$46","v":"分会青年部幹事会"},{"$f":"IF(データリスト!$T53=\"\",\"\",データリスト!$T53)","v":""},{"$nulls":17},{"$f":"IF(I295:N295=\"\",\"\",IF(J295:N295=\"\",I295,IF(K295:N295=\"\",I295&\"・\"&J295,IF(L295:N295=\"\",I295&\"・\"&J295&\"・\"&K295,IF(M295:N295=\"\",I295&\"・\"&J295&\"・\"&K295&\"・\"&L295,IF(N295=\"\",I295&\"・\"&J295&\"・\"&K295&\"・\"&L295&\"・\"&M295,I295&\"・\"&J295&\"・\"&K295&\"・\"&L295&\"・\"&M295&\"・\"&N295))))))","v":""},"","","","",""]
[null,{"$f":"データリスト!T$46","v":"分会青年部幹事会"},{"$f":"IF(データリスト!$T54=\"\",\"\",データリスト!$T54)","v":""},{"$nulls":17},{"$f":"IF(I296:N296=\"\",\"\",IF(J296:N296=\"\",I296,IF(K296:N296=\"\",I296&\"・\"&J296,IF(L296:N296=\"\",I296&\"・\"&J296&\"・\"&K296,IF(M296:N296=\"\",I296&\"・\"&J296&\"・\"&K296&\"・\"&L296,IF(N296=\"\",I296&\"・\"&J296&\"・\"&K296&\"・\"&L296&\"・\"&M296,I296&\"・\"&J296&\"・\"&K296&\"・\"&L296&\"・\"&M296&\"・\"&N296))))))","v":""},"","","","",""]
[null,{"$f":"データリスト!T$46","v":"分会青年部幹事会"},{"$f":"IF(データリスト!$T55=\"\",\"\",データリスト!$T55)","v":""},{"$nulls":17},{"$f":"IF(I297:N297=\"\",\"\",IF(J297:N297=\"\",I297,IF(K297:N297=\"\",I297&\"・\"&J297,IF(L297:N297=\"\",I297&\"・\"&J297&\"・\"&K297,IF(M297:N297=\"\",I297&\"・\"&J297&\"・\"&K297&\"・\"&L297,IF(N297=\"\",I297&\"・\"&J297&\"・\"&K297&\"・\"&L297&\"・\"&M297,I297&\"・\"&J297&\"・\"&K297&\"・\"&L297&\"・\"&M297&\"・\"&N297))))))","v":""},"","","","",""]
[null,{"$f":"データリスト!T$46","v":"分会青年部幹事会"},{"$f":"IF(データリスト!$T56=\"\",\"\",データリスト!$T56)","v":""},{"$nulls":17},{"$f":"IF(I298:N298=\"\",\"\",IF(J298:N298=\"\",I298,IF(K298:N298=\"\",I298&\"・\"&J298,IF(L298:N298=\"\",I298&\"・\"&J298&\"・\"&K298,IF(M298:N298=\"\",I298&\"・\"&J298&\"・\"&K298&\"・\"&L298,IF(N298=\"\",I298&\"・\"&J298&\"・\"&K298&\"・\"&L298&\"・\"&M298,I298&\"・\"&J298&\"・\"&K298&\"・\"&L298&\"・\"&M298&\"・\"&N298))))))","v":""},"","","","",""]
[null,{"$f":"データリスト!T$46","v":"分会青年部幹事会"},{"$f":"IF(データリスト!$T57=\"\",\"\",データリスト!$T57)","v":""},{"$nulls":17},{"$f":"IF(I299:N299=\"\",\"\",IF(J299:N299=\"\",I299,IF(K299:N299=\"\",I299&\"・\"&J299,IF(L299:N299=\"\",I299&\"・\"&J299&\"・\"&K299,IF(M299:N299=\"\",I299&\"・\"&J299&\"・\"&K299&\"・\"&L299,IF(N299=\"\",I299&\"・\"&J299&\"・\"&K299&\"・\"&L299&\"・\"&M299,I299&\"・\"&J299&\"・\"&K299&\"・\"&L299&\"・\"&M299&\"・\"&N299))))))","v":""},"","","","",""]
[null,{"$f":"データリスト!T$46","v":"分会青年部幹事会"},{"$f":"IF(データリスト!$T58=\"\",\"\",データリスト!$T58)","v":""},{"$nulls":17},{"$f":"IF(I300:N300=\"\",\"\",IF(J300:N300=\"\",I300,IF(K300:N300=\"\",I300&\"・\"&J300,IF(L300:N300=\"\",I300&\"・\"&J300&\"・\"&K300,IF(M300:N300=\"\",I300&\"・\"&J300&\"・\"&K300&\"・\"&L300,IF(N300=\"\",I300&\"・\"&J300&\"・\"&K300&\"・\"&L300&\"・\"&M300,I300&\"・\"&J300&\"・\"&K300&\"・\"&L300&\"・\"&M300&\"・\"&N300))))))","v":""},"","","","",""]
[null,{"$f":"データリスト!T$46","v":"分会青年部幹事会"},{"$f":"IF(データリスト!$T59=\"\",\"\",データリスト!$T59)","v":""},{"$nulls":17},{"$f":"IF(I301:N301=\"\",\"\",IF(J301:N301=\"\",I301,IF(K301:N301=\"\",I301&\"・\"&J301,IF(L301:N301=\"\",I301&\"・\"&J301&\"・\"&K301,IF(M301:N301=\"\",I301&\"・\"&J301&\"・\"&K301&\"・\"&L301,IF(N301=\"\",I301&\"・\"&J301&\"・\"&K301&\"・\"&L301&\"・\"&M301,I301&\"・\"&J301&\"・\"&K301&\"・\"&L301&\"・\"&M301&\"・\"&N301))))))","v":""},"","","","",""]
[null,{"$f":"データリスト!T$46","v":"分会青年部幹事会"},{"$f":"IF(データリスト!$T60=\"\",\"\",データリスト!$T60)","v":""},{"$nulls":17},{"$f":"IF(I302:N302=\"\",\"\",IF(J302:N302=\"\",I302,IF(K302:N302=\"\",I302&\"・\"&J302,IF(L302:N302=\"\",I302&\"・\"&J302&\"・\"&K302,IF(M302:N302=\"\",I302&\"・\"&J302&\"・\"&K302&\"・\"&L302,IF(N302=\"\",I302&\"・\"&J302&\"・\"&K302&\"・\"&L302&\"・\"&M302,I302&\"・\"&J302&\"・\"&K302&\"・\"&L302&\"・\"&M302&\"・\"&N302))))))","v":""},"","","","",""]
[null,{"$f":"データリスト!T$46","v":"分会青年部幹事会"},{"$f":"IF(データリスト!$T61=\"\",\"\",データリスト!$T61)","v":""},{"$nulls":17},{"$f":"IF(I303:N303=\"\",\"\",IF(J303:N303=\"\",I303,IF(K303:N303=\"\",I303&\"・\"&J303,IF(L303:N303=\"\",I303&\"・\"&J303&\"・\"&K303,IF(M303:N303=\"\",I303&\"・\"&J303&\"・\"&K303&\"・\"&L303,IF(N303=\"\",I303&\"・\"&J303&\"・\"&K303&\"・\"&L303&\"・\"&M303,I303&\"・\"&J303&\"・\"&K303&\"・\"&L303&\"・\"&M303&\"・\"&N303))))))","v":""},"","","","",""]
[null,{"$f":"データリスト!T$46","v":"分会青年部幹事会"},{"$f":"IF(データリスト!$T62=\"\",\"\",データリスト!$T62)","v":""},{"$nulls":17},{"$f":"IF(I304:N304=\"\",\"\",IF(J304:N304=\"\",I304,IF(K304:N304=\"\",I304&\"・\"&J304,IF(L304:N304=\"\",I304&\"・\"&J304&\"・\"&K304,IF(M304:N304=\"\",I304&\"・\"&J304&\"・\"&K304&\"・\"&L304,IF(N304=\"\",I304&\"・\"&J304&\"・\"&K304&\"・\"&L304&\"・\"&M304,I304&\"・\"&J304&\"・\"&K304&\"・\"&L304&\"・\"&M304&\"・\"&N304))))))","v":""},"","","","",""]
[null,{"$f":"データリスト!T$46","v":"分会青年部幹事会"},{"$f":"IF(データリスト!$T63=\"\",\"\",データリスト!$T63)","v":""},{"$nulls":17},{"$f":"IF(I305:N305=\"\",\"\",IF(J305:N305=\"\",I305,IF(K305:N305=\"\",I305&\"・\"&J305,IF(L305:N305=\"\",I305&\"・\"&J305&\"・\"&K305,IF(M305:N305=\"\",I305&\"・\"&J305&\"・\"&K305&\"・\"&L305,IF(N305=\"\",I305&\"・\"&J305&\"・\"&K305&\"・\"&L305&\"・\"&M305,I305&\"・\"&J305&\"・\"&K305&\"・\"&L305&\"・\"&M305&\"・\"&N305))))))","v":""},"","","","",""]
[null,{"$f":"データリスト!T$46","v":"分会青年部幹事会"},{"$f":"IF(データリスト!$T64=\"\",\"\",データリスト!$T64)","v":""},{"$nulls":17},{"$f":"IF(I306:N306=\"\",\"\",IF(J306:N306=\"\",I306,IF(K306:N306=\"\",I306&\"・\"&J306,IF(L306:N306=\"\",I306&\"・\"&J306&\"・\"&K306,IF(M306:N306=\"\",I306&\"・\"&J306&\"・\"&K306&\"・\"&L306,IF(N306=\"\",I306&\"・\"&J306&\"・\"&K306&\"・\"&L306&\"・\"&M306,I306&\"・\"&J306&\"・\"&K306&\"・\"&L306&\"・\"&M306&\"・\"&N306))))))","v":""},"","","","",""]
[null,{"$f":"データリスト!T$46","v":"分会青年部幹事会"},{"$f":"IF(データリスト!$T65=\"\",\"\",データリスト!$T65)","v":""},{"$nulls":17},{"$f":"IF(I307:N307=\"\",\"\",IF(J307:N307=\"\",I307,IF(K307:N307=\"\",I307&\"・\"&J307,IF(L307:N307=\"\",I307&\"・\"&J307&\"・\"&K307,IF(M307:N307=\"\",I307&\"・\"&J307&\"・\"&K307&\"・\"&L307,IF(N307=\"\",I307&\"・\"&J307&\"・\"&K307&\"・\"&L307&\"・\"&M307,I307&\"・\"&J307&\"・\"&K307&\"・\"&L307&\"・\"&M307&\"・\"&N307))))))","v":""},"","","","",""]
[null,{"$f":"データリスト!T$46","v":"分会青年部幹事会"},{"$f":"IF(データリスト!$T66=\"\",\"\",データリスト!$T66)","v":""},{"$nulls":17},{"$f":"IF(I308:N308=\"\",\"\",IF(J308:N308=\"\",I308,IF(K308:N308=\"\",I308&\"・\"&J308,IF(L308:N308=\"\",I308&\"・\"&J308&\"・\"&K308,IF(M308:N308=\"\",I308&\"・\"&J308&\"・\"&K308&\"・\"&L308,IF(N308=\"\",I308&\"・\"&J308&\"・\"&K308&\"・\"&L308&\"・\"&M308,I308&\"・\"&J308&\"・\"&K308&\"・\"&L308&\"・\"&M308&\"・\"&N308))))))","v":""},"","","","",""]
[null,{"$f":"データリスト!U$46","v":"各種役員選挙"},{"$f":"IF(データリスト!$U47=\"\",\"\",データリスト!$U47)","v":"選挙管理委員会設置"},{"$nulls":17},{"$f":"IF(I309:N309=\"\",\"\",IF(J309:N309=\"\",I309,IF(K309:N309=\"\",I309&\"・\"&J309,IF(L309:N309=\"\",I309&\"・\"&J309&\"・\"&K309,IF(M309:N309=\"\",I309&\"・\"&J309&\"・\"&K309&\"・\"&L309,IF(N309=\"\",I309&\"・\"&J309&\"・\"&K309&\"・\"&L309&\"・\"&M309,I309&\"・\"&J309&\"・\"&K309&\"・\"&L309&\"・\"&M309&\"・\"&N309))))))","v":""},"","","","",""]
[null,{"$f":"データリスト!U$46","v":"各種役員選挙"},{"$f":"IF(データリスト!$U48=\"\",\"\",データリスト!$U48)","v":"告示"},{"$nulls":17},{"$f":"IF(I310:N310=\"\",\"\",IF(J310:N310=\"\",I310,IF(K310:N310=\"\",I310&\"・\"&J310,IF(L310:N310=\"\",I310&\"・\"&J310&\"・\"&K310,IF(M310:N310=\"\",I310&\"・\"&J310&\"・\"&K310&\"・\"&L310,IF(N310=\"\",I310&\"・\"&J310&\"・\"&K310&\"・\"&L310&\"・\"&M310,I310&\"・\"&J310&\"・\"&K310&\"・\"&L310&\"・\"&M310&\"・\"&N310))))))","v":""},"","","","",""]
[null,{"$f":"データリスト!U$46","v":"各種役員選挙"},{"$f":"IF(データリスト!$U49=\"\",\"\",データリスト!$U49)","v":"立候補"},{"$nulls":17},{"$f":"IF(I311:N311=\"\",\"\",IF(J311:N311=\"\",I311,IF(K311:N311=\"\",I311&\"・\"&J311,IF(L311:N311=\"\",I311&\"・\"&J311&\"・\"&K311,IF(M311:N311=\"\",I311&\"・\"&J311&\"・\"&K311&\"・\"&L311,IF(N311=\"\",I311&\"・\"&J311&\"・\"&K311&\"・\"&L311&\"・\"&M311,I311&\"・\"&J311&\"・\"&K311&\"・\"&L311&\"・\"&M311&\"・\"&N311))))))","v":""},"","","","",""]
[null,{"$f":"データリスト!U$46","v":"各種役員選挙"},{"$f":"IF(データリスト!$U50=\"\",\"\",データリスト!$U50)","v":"公示"},{"$nulls":17},{"$f":"IF(I312:N312=\"\",\"\",IF(J312:N312=\"\",I312,IF(K312:N312=\"\",I312&\"・\"&J312,IF(L312:N312=\"\",I312&\"・\"&J312&\"・\"&K312,IF(M312:N312=\"\",I312&\"・\"&J312&\"・\"&K312&\"・\"&L312,IF(N312=\"\",I312&\"・\"&J312&\"・\"&K312&\"・\"&L312&\"・\"&M312,I312&\"・\"&J312&\"・\"&K312&\"・\"&L312&\"・\"&M312&\"・\"&N312))))))","v":""},"","","","",""]
[null,{"$f":"データリスト!U$46","v":"各種役員選挙"},{"$f":"IF(データリスト!$U51=\"\",\"\",データリスト!$U51)","v":"投票"},{"$nulls":17},{"$f":"IF(I313:N313=\"\",\"\",IF(J313:N313=\"\",I313,IF(K313:N313=\"\",I313&\"・\"&J313,IF(L313:N313=\"\",I313&\"・\"&J313&\"・\"&K313,IF(M313:N313=\"\",I313&\"・\"&J313&\"・\"&K313&\"・\"&L313,IF(N313=\"\",I313&\"・\"&J313&\"・\"&K313&\"・\"&L313&\"・\"&M313,I313&\"・\"&J313&\"・\"&K313&\"・\"&L313&\"・\"&M313&\"・\"&N313))))))","v":""},"","","","",""]
[null,{"$f":"データリスト!U$46","v":"各種役員選挙"},{"$f":"IF(データリスト!$U52=\"\",\"\",データリスト!$U52)","v":""},{"$nulls":17},{"$f":"IF(I314:N314=\"\",\"\",IF(J314:N314=\"\",I314,IF(K314:N314=\"\",I314&\"・\"&J314,IF(L314:N314=\"\",I314&\"・\"&J314&\"・\"&K314,IF(M314:N314=\"\",I314&\"・\"&J314&\"・\"&K314&\"・\"&L314,IF(N314=\"\",I314&\"・\"&J314&\"・\"&K314&\"・\"&L314&\"・\"&M314,I314&\"・\"&J314&\"・\"&K314&\"・\"&L314&\"・\"&M314&\"・\"&N314))))))","v":""},"","","","",""]
[null,{"$f":"データリスト!U$46","v":"各種役員選挙"},{"$f":"IF(データリスト!$U53=\"\",\"\",データリスト!$U53)","v":""},{"$nulls":17},{"$f":"IF(I315:N315=\"\",\"\",IF(J315:N315=\"\",I315,IF(K315:N315=\"\",I315&\"・\"&J315,IF(L315:N315=\"\",I315&\"・\"&J315&\"・\"&K315,IF(M315:N315=\"\",I315&\"・\"&J315&\"・\"&K315&\"・\"&L315,IF(N315=\"\",I315&\"・\"&J315&\"・\"&K315&\"・\"&L315&\"・\"&M315,I315&\"・\"&J315&\"・\"&K315&\"・\"&L315&\"・\"&M315&\"・\"&N315))))))","v":""},"","","","",""]
[null,{"$f":"データリスト!U$46","v":"各種役員選挙"},{"$f":"IF(データリスト!$U54=\"\",\"\",データリスト!$U54)","v":""},{"$nulls":17},{"$f":"IF(I316:N316=\"\",\"\",IF(J316:N316=\"\",I316,IF(K316:N316=\"\",I316&\"・\"&J316,IF(L316:N316=\"\",I316&\"・\"&J316&\"・\"&K316,IF(M316:N316=\"\",I316&\"・\"&J316&\"・\"&K316&\"・\"&L316,IF(N316=\"\",I316&\"・\"&J316&\"・\"&K316&\"・\"&L316&\"・\"&M316,I316&\"・\"&J316&\"・\"&K316&\"・\"&L316&\"・\"&M316&\"・\"&N316))))))","v":""},"","","","",""]
[null,{"$f":"データリスト!U$46","v":"各種役員選挙"},{"$f":"IF(データリスト!$U55=\"\",\"\",データリスト!$U55)","v":""},{"$nulls":17},{"$f":"IF(I317:N317=\"\",\"\",IF(J317:N317=\"\",I317,IF(K317:N317=\"\",I317&\"・\"&J317,IF(L317:N317=\"\",I317&\"・\"&J317&\"・\"&K317,IF(M317:N317=\"\",I317&\"・\"&J317&\"・\"&K317&\"・\"&L317,IF(N317=\"\",I317&\"・\"&J317&\"・\"&K317&\"・\"&L317&\"・\"&M317,I317&\"・\"&J317&\"・\"&K317&\"・\"&L317&\"・\"&M317&\"・\"&N317))))))","v":""},"","","","",""]
[null,{"$f":"データリスト!U$46","v":"各種役員選挙"},{"$f":"IF(データリスト!$U56=\"\",\"\",データリスト!$U56)","v":""},{"$nulls":17},{"$f":"IF(I318:N318=\"\",\"\",IF(J318:N318=\"\",I318,IF(K318:N318=\"\",I318&\"・\"&J318,IF(L318:N318=\"\",I318&\"・\"&J318&\"・\"&K318,IF(M318:N318=\"\",I318&\"・\"&J318&\"・\"&K318&\"・\"&L318,IF(N318=\"\",I318&\"・\"&J318&\"・\"&K318&\"・\"&L318&\"・\"&M318,I318&\"・\"&J318&\"・\"&K318&\"・\"&L318&\"・\"&M318&\"・\"&N318))))))","v":""},"","","","",""]
[null,{"$f":"データリスト!U$46","v":"各種役員選挙"},{"$f":"IF(データリスト!$U57=\"\",\"\",データリスト!$U57)","v":""},{"$nulls":17},{"$f":"IF(I319:N319=\"\",\"\",IF(J319:N319=\"\",I319,IF(K319:N319=\"\",I319&\"・\"&J319,IF(L319:N319=\"\",I319&\"・\"&J319&\"・\"&K319,IF(M319:N319=\"\",I319&\"・\"&J319&\"・\"&K319&\"・\"&L319,IF(N319=\"\",I319&\"・\"&J319&\"・\"&K319&\"・\"&L319&\"・\"&M319,I319&\"・\"&J319&\"・\"&K319&\"・\"&L319&\"・\"&M319&\"・\"&N319))))))","v":""},"","","","",""]
[null,{"$f":"データリスト!U$46","v":"各種役員選挙"},{"$f":"IF(データリスト!$U58=\"\",\"\",データリスト!$U58)","v":""},{"$nulls":17},{"$f":"IF(I320:N320=\"\",\"\",IF(J320:N320=\"\",I320,IF(K320:N320=\"\",I320&\"・\"&J320,IF(L320:N320=\"\",I320&\"・\"&J320&\"・\"&K320,IF(M320:N320=\"\",I320&\"・\"&J320&\"・\"&K320&\"・\"&L320,IF(N320=\"\",I320&\"・\"&J320&\"・\"&K320&\"・\"&L320&\"・\"&M320,I320&\"・\"&J320&\"・\"&K320&\"・\"&L320&\"・\"&M320&\"・\"&N320))))))","v":""},"","","","",""]
[null,{"$f":"データリスト!U$46","v":"各種役員選挙"},{"$f":"IF(データリスト!$U59=\"\",\"\",データリスト!$U59)","v":""},{"$nulls":17},{"$f":"IF(I321:N321=\"\",\"\",IF(J321:N321=\"\",I321,IF(K321:N321=\"\",I321&\"・\"&J321,IF(L321:N321=\"\",I321&\"・\"&J321&\"・\"&K321,IF(M321:N321=\"\",I321&\"・\"&J321&\"・\"&K321&\"・\"&L321,IF(N321=\"\",I321&\"・\"&J321&\"・\"&K321&\"・\"&L321&\"・\"&M321,I321&\"・\"&J321&\"・\"&K321&\"・\"&L321&\"・\"&M321&\"・\"&N321))))))","v":""},"","","","",""]
[null,{"$f":"データリスト!U$46","v":"各種役員選挙"},{"$f":"IF(データリスト!$U60=\"\",\"\",データリスト!$U60)","v":""},{"$nulls":17},{"$f":"IF(I322:N322=\"\",\"\",IF(J322:N322=\"\",I322,IF(K322:N322=\"\",I322&\"・\"&J322,IF(L322:N322=\"\",I322&\"・\"&J322&\"・\"&K322,IF(M322:N322=\"\",I322&\"・\"&J322&\"・\"&K322&\"・\"&L322,IF(N322=\"\",I322&\"・\"&J322&\"・\"&K322&\"・\"&L322&\"・\"&M322,I322&\"・\"&J322&\"・\"&K322&\"・\"&L322&\"・\"&M322&\"・\"&N322))))))","v":""},"","","","",""]
[null,{"$f":"データリスト!U$46","v":"各種役員選挙"},{"$f":"IF(データリスト!$U61=\"\",\"\",データリスト!$U61)","v":""},{"$nulls":17},{"$f":"IF(I323:N323=\"\",\"\",IF(J323:N323=\"\",I323,IF(K323:N323=\"\",I323&\"・\"&J323,IF(L323:N323=\"\",I323&\"・\"&J323&\"・\"&K323,IF(M323:N323=\"\",I323&\"・\"&J323&\"・\"&K323&\"・\"&L323,IF(N323=\"\",I323&\"・\"&J323&\"・\"&K323&\"・\"&L323&\"・\"&M323,I323&\"・\"&J323&\"・\"&K323&\"・\"&L323&\"・\"&M323&\"・\"&N323))))))","v":""},"","","","",""]
[null,{"$f":"データリスト!U$46","v":"各種役員選挙"},{"$f":"IF(データリスト!$U62=\"\",\"\",データリスト!$U62)","v":""},{"$nulls":17},{"$f":"IF(I324:N324=\"\",\"\",IF(J324:N324=\"\",I324,IF(K324:N324=\"\",I324&\"・\"&J324,IF(L324:N324=\"\",I324&\"・\"&J324&\"・\"&K324,IF(M324:N324=\"\",I324&\"・\"&J324&\"・\"&K324&\"・\"&L324,IF(N324=\"\",I324&\"・\"&J324&\"・\"&K324&\"・\"&L324&\"・\"&M324,I324&\"・\"&J324&\"・\"&K324&\"・\"&L324&\"・\"&M324&\"・\"&N324))))))","v":""},"","","","",""]
[null,{"$f":"データリスト!U$46","v":"各種役員選挙"},{"$f":"IF(データリスト!$U63=\"\",\"\",データリスト!$U63)","v":""},{"$nulls":17},{"$f":"IF(I325:N325=\"\",\"\",IF(J325:N325=\"\",I325,IF(K325:N325=\"\",I325&\"・\"&J325,IF(L325:N325=\"\",I325&\"・\"&J325&\"・\"&K325,IF(M325:N325=\"\",I325&\"・\"&J325&\"・\"&K325&\"・\"&L325,IF(N325=\"\",I325&\"・\"&J325&\"・\"&K325&\"・\"&L325&\"・\"&M325,I325&\"・\"&J325&\"・\"&K325&\"・\"&L325&\"・\"&M325&\"・\"&N325))))))","v":""},"","","","",""]
[null,{"$f":"データリスト!U$46","v":"各種役員選挙"},{"$f":"IF(データリスト!$U64=\"\",\"\",データリスト!$U64)","v":""},{"$nulls":17},{"$f":"IF(I326:N326=\"\",\"\",IF(J326:N326=\"\",I326,IF(K326:N326=\"\",I326&\"・\"&J326,IF(L326:N326=\"\",I326&\"・\"&J326&\"・\"&K326,IF(M326:N326=\"\",I326&\"・\"&J326&\"・\"&K326&\"・\"&L326,IF(N326=\"\",I326&\"・\"&J326&\"・\"&K326&\"・\"&L326&\"・\"&M326,I326&\"・\"&J326&\"・\"&K326&\"・\"&L326&\"・\"&M326&\"・\"&N326))))))","v":""},"","","","",""]
[null,{"$f":"データリスト!U$46","v":"各種役員選挙"},{"$f":"IF(データリスト!$U65=\"\",\"\",データリスト!$U65)","v":""},{"$nulls":17},{"$f":"IF(I327:N327=\"\",\"\",IF(J327:N327=\"\",I327,IF(K327:N327=\"\",I327&\"・\"&J327,IF(L327:N327=\"\",I327&\"・\"&J327&\"・\"&K327,IF(M327:N327=\"\",I327&\"・\"&J327&\"・\"&K327&\"・\"&L327,IF(N327=\"\",I327&\"・\"&J327&\"・\"&K327&\"・\"&L327&\"・\"&M327,I327&\"・\"&J327&\"・\"&K327&\"・\"&L327&\"・\"&M327&\"・\"&N327))))))","v":""},"","","","",""]
[null,{"$f":"データリスト!U$46","v":"各種役員選挙"},{"$f":"IF(データリスト!$U66=\"\",\"\",データリスト!$U66)","v":""},{"$nulls":17},{"$f":"IF(I328:N328=\"\",\"\",IF(J328:N328=\"\",I328,IF(K328:N328=\"\",I328&\"・\"&J328,IF(L328:N328=\"\",I328&\"・\"&J328&\"・\"&K328,IF(M328:N328=\"\",I328&\"・\"&J328&\"・\"&K328&\"・\"&L328,IF(N328=\"\",I328&\"・\"&J328&\"・\"&K328&\"・\"&L328&\"・\"&M328,I328&\"・\"&J328&\"・\"&K328&\"・\"&L328&\"・\"&M328&\"・\"&N328))))))","v":""},"","","","",""]
[null,{"$f":"データリスト!V$46","v":"労使協議会"},{"$f":"IF(データリスト!$V47=\"\",\"\",データリスト!$V47)","v":"会社との日程調整"},{"$nulls":17},{"$f":"IF(I329:N329=\"\",\"\",IF(J329:N329=\"\",I329,IF(K329:N329=\"\",I329&\"・\"&J329,IF(L329:N329=\"\",I329&\"・\"&J329&\"・\"&K329,IF(M329:N329=\"\",I329&\"・\"&J329&\"・\"&K329&\"・\"&L329,IF(N329=\"\",I329&\"・\"&J329&\"・\"&K329&\"・\"&L329&\"・\"&M329,I329&\"・\"&J329&\"・\"&K329&\"・\"&L329&\"・\"&M329&\"・\"&N329))))))","v":""},"","","","",""]
[null,{"$f":"データリスト!V$46","v":"労使協議会"},{"$f":"IF(データリスト!$V48=\"\",\"\",データリスト!$V48)","v":"分会執行委員会（日程の確認）"},{"$nulls":17},{"$f":"IF(I330:N330=\"\",\"\",IF(J330:N330=\"\",I330,IF(K330:N330=\"\",I330&\"・\"&J330,IF(L330:N330=\"\",I330&\"・\"&J330&\"・\"&K330,IF(M330:N330=\"\",I330&\"・\"&J330&\"・\"&K330&\"・\"&L330,IF(N330=\"\",I330&\"・\"&J330&\"・\"&K330&\"・\"&L330&\"・\"&M330,I330&\"・\"&J330&\"・\"&K330&\"・\"&L330&\"・\"&M330&\"・\"&N330))))))","v":""},"","","","",""]
[null,{"$f":"データリスト!V$46","v":"労使協議会"},{"$f":"IF(データリスト!$V49=\"\",\"\",データリスト!$V49)","v":"分会集会（意見収集）"},{"$nulls":17},{"$f":"IF(I331:N331=\"\",\"\",IF(J331:N331=\"\",I331,IF(K331:N331=\"\",I331&\"・\"&J331,IF(L331:N331=\"\",I331&\"・\"&J331&\"・\"&K331,IF(M331:N331=\"\",I331&\"・\"&J331&\"・\"&K331&\"・\"&L331,IF(N331=\"\",I331&\"・\"&J331&\"・\"&K331&\"・\"&L331&\"・\"&M331,I331&\"・\"&J331&\"・\"&K331&\"・\"&L331&\"・\"&M331&\"・\"&N331))))))","v":""},"","","","",""]
[null,{"$f":"データリスト!V$46","v":"労使協議会"},{"$f":"IF(データリスト!$V50=\"\",\"\",データリスト!$V50)","v":"分会執行委員会（議題の提案）"},{"$nulls":17},{"$f":"IF(I332:N332=\"\",\"\",IF(J332:N332=\"\",I332,IF(K332:N332=\"\",I332&\"・\"&J332,IF(L332:N332=\"\",I332&\"・\"&J332&\"・\"&K332,IF(M332:N332=\"\",I332&\"・\"&J332&\"・\"&K332&\"・\"&L332,IF(N332=\"\",I332&\"・\"&J332&\"・\"&K332&\"・\"&L332&\"・\"&M332,I332&\"・\"&J332&\"・\"&K332&\"・\"&L332&\"・\"&M332&\"・\"&N332))))))","v":""},"","","","",""]
[null,{"$f":"データリスト!V$46","v":"労使協議会"},{"$f":"IF(データリスト!$V51=\"\",\"\",データリスト!$V51)","v":"分会集会（提起議題決定）"},{"$nulls":17},{"$f":"IF(I333:N333=\"\",\"\",IF(J333:N333=\"\",I333,IF(K333:N333=\"\",I333&\"・\"&J333,IF(L333:N333=\"\",I333&\"・\"&J333&\"・\"&K333,IF(M333:N333=\"\",I333&\"・\"&J333&\"・\"&K333&\"・\"&L333,IF(N333=\"\",I333&\"・\"&J333&\"・\"&K333&\"・\"&L333&\"・\"&M333,I333&\"・\"&J333&\"・\"&K333&\"・\"&L333&\"・\"&M333&\"・\"&N333))))))","v":""},"","","","",""]
[null,{"$f":"データリスト!V$46","v":"労使協議会"},{"$f":"IF(データリスト!$V52=\"\",\"\",データリスト!$V52)","v":"議題会社提起"},{"$nulls":17},{"$f":"IF(I334:N334=\"\",\"\",IF(J334:N334=\"\",I334,IF(K334:N334=\"\",I334&\"・\"&J334,IF(L334:N334=\"\",I334&\"・\"&J334&\"・\"&K334,IF(M334:N334=\"\",I334&\"・\"&J334&\"・\"&K334&\"・\"&L334,IF(N334=\"\",I334&\"・\"&J334&\"・\"&K334&\"・\"&L334&\"・\"&M334,I334&\"・\"&J334&\"・\"&K334&\"・\"&L334&\"・\"&M334&\"・\"&N334))))))","v":""},"","","","",""]
[null,{"$f":"データリスト!V$46","v":"労使協議会"},{"$f":"IF(データリスト!$V53=\"\",\"\",データリスト!$V53)","v":"協議会の開催"},{"$nulls":17},{"$f":"IF(I335:N335=\"\",\"\",IF(J335:N335=\"\",I335,IF(K335:N335=\"\",I335&\"・\"&J335,IF(L335:N335=\"\",I335&\"・\"&J335&\"・\"&K335,IF(M335:N335=\"\",I335&\"・\"&J335&\"・\"&K335&\"・\"&L335,IF(N335=\"\",I335&\"・\"&J335&\"・\"&K335&\"・\"&L335&\"・\"&M335,I335&\"・\"&J335&\"・\"&K335&\"・\"&L335&\"・\"&M335&\"・\"&N335))))))","v":""},"","","","",""]
[null,{"$f":"データリスト!V$46","v":"労使協議会"},{"$f":"IF(データリスト!$V54=\"\",\"\",データリスト!$V54)","v":"分会集会にて協議事項の周知"},{"$nulls":17},{"$f":"IF(I336:N336=\"\",\"\",IF(J336:N336=\"\",I336,IF(K336:N336=\"\",I336&\"・\"&J336,IF(L336:N336=\"\",I336&\"・\"&J336&\"・\"&K336,IF(M336:N336=\"\",I336&\"・\"&J336&\"・\"&K336&\"・\"&L336,IF(N336=\"\",I336&\"・\"&J336&\"・\"&K336&\"・\"&L336&\"・\"&M336,I336&\"・\"&J336&\"・\"&K336&\"・\"&L336&\"・\"&M336&\"・\"&N336))))))","v":""},"","","","",""]
[null,{"$f":"データリスト!V$46","v":"労使協議会"},{"$f":"IF(データリスト!$V55=\"\",\"\",データリスト!$V55)","v":""},{"$nulls":17},{"$f":"IF(I337:N337=\"\",\"\",IF(J337:N337=\"\",I337,IF(K337:N337=\"\",I337&\"・\"&J337,IF(L337:N337=\"\",I337&\"・\"&J337&\"・\"&K337,IF(M337:N337=\"\",I337&\"・\"&J337&\"・\"&K337&\"・\"&L337,IF(N337=\"\",I337&\"・\"&J337&\"・\"&K337&\"・\"&L337&\"・\"&M337,I337&\"・\"&J337&\"・\"&K337&\"・\"&L337&\"・\"&M337&\"・\"&N337))))))","v":""},"","","","",""]
[null,{"$f":"データリスト!V$46","v":"労使協議会"},{"$f":"IF(データリスト!$V56=\"\",\"\",データリスト!$V56)","v":""},{"$nulls":17},{"$f":"IF(I338:N338=\"\",\"\",IF(J338:N338=\"\",I338,IF(K338:N338=\"\",I338&\"・\"&J338,IF(L338:N338=\"\",I338&\"・\"&J338&\"・\"&K338,IF(M338:N338=\"\",I338&\"・\"&J338&\"・\"&K338&\"・\"&L338,IF(N338=\"\",I338&\"・\"&J338&\"・\"&K338&\"・\"&L338&\"・\"&M338,I338&\"・\"&J338&\"・\"&K338&\"・\"&L338&\"・\"&M338&\"・\"&N338))))))","v":""},"","","","",""]
[null,{"$f":"データリスト!V$46","v":"労使協議会"},{"$f":"IF(データリスト!$V57=\"\",\"\",データリスト!$V57)","v":""},{"$nulls":17},{"$f":"IF(I339:N339=\"\",\"\",IF(J339:N339=\"\",I339,IF(K339:N339=\"\",I339&\"・\"&J339,IF(L339:N339=\"\",I339&\"・\"&J339&\"・\"&K339,IF(M339:N339=\"\",I339&\"・\"&J339&\"・\"&K339&\"・\"&L339,IF(N339=\"\",I339&\"・\"&J339&\"・\"&K339&\"・\"&L339&\"・\"&M339,I339&\"・\"&J339&\"・\"&K339&\"・\"&L339&\"・\"&M339&\"・\"&N339))))))","v":""},"","","","",""]
[null,{"$f":"データリスト!V$46","v":"労使協議会"},{"$f":"IF(データリスト!$V58=\"\",\"\",データリスト!$V58)","v":""},{"$nulls":17},{"$f":"IF(I340:N340=\"\",\"\",IF(J340:N340=\"\",I340,IF(K340:N340=\"\",I340&\"・\"&J340,IF(L340:N340=\"\",I340&\"・\"&J340&\"・\"&K340,IF(M340:N340=\"\",I340&\"・\"&J340&\"・\"&K340&\"・\"&L340,IF(N340=\"\",I340&\"・\"&J340&\"・\"&K340&\"・\"&L340&\"・\"&M340,I340&\"・\"&J340&\"・\"&K340&\"・\"&L340&\"・\"&M340&\"・\"&N340))))))","v":""},"","","","",""]
[null,{"$f":"データリスト!V$46","v":"労使協議会"},{"$f":"IF(データリスト!$V59=\"\",\"\",データリスト!$V59)","v":""},{"$nulls":17},{"$f":"IF(I341:N341=\"\",\"\",IF(J341:N341=\"\",I341,IF(K341:N341=\"\",I341&\"・\"&J341,IF(L341:N341=\"\",I341&\"・\"&J341&\"・\"&K341,IF(M341:N341=\"\",I341&\"・\"&J341&\"・\"&K341&\"・\"&L341,IF(N341=\"\",I341&\"・\"&J341&\"・\"&K341&\"・\"&L341&\"・\"&M341,I341&\"・\"&J341&\"・\"&K341&\"・\"&L341&\"・\"&M341&\"・\"&N341))))))","v":""},"","","","",""]
[null,{"$f":"データリスト!V$46","v":"労使協議会"},{"$f":"IF(データリスト!$V60=\"\",\"\",データリスト!$V60)","v":""},{"$nulls":17},{"$f":"IF(I342:N342=\"\",\"\",IF(J342:N342=\"\",I342,IF(K342:N342=\"\",I342&\"・\"&J342,IF(L342:N342=\"\",I342&\"・\"&J342&\"・\"&K342,IF(M342:N342=\"\",I342&\"・\"&J342&\"・\"&K342&\"・\"&L342,IF(N342=\"\",I342&\"・\"&J342&\"・\"&K342&\"・\"&L342&\"・\"&M342,I342&\"・\"&J342&\"・\"&K342&\"・\"&L342&\"・\"&M342&\"・\"&N342))))))","v":""},"","","","",""]
[null,{"$f":"データリスト!V$46","v":"労使協議会"},{"$f":"IF(データリスト!$V61=\"\",\"\",データリスト!$V61)","v":""},{"$nulls":17},{"$f":"IF(I343:N343=\"\",\"\",IF(J343:N343=\"\",I343,IF(K343:N343=\"\",I343&\"・\"&J343,IF(L343:N343=\"\",I343&\"・\"&J343&\"・\"&K343,IF(M343:N343=\"\",I343&\"・\"&J343&\"・\"&K343&\"・\"&L343,IF(N343=\"\",I343&\"・\"&J343&\"・\"&K343&\"・\"&L343&\"・\"&M343,I343&\"・\"&J343&\"・\"&K343&\"・\"&L343&\"・\"&M343&\"・\"&N343))))))","v":""},"","","","",""]
[null,{"$f":"データリスト!V$46","v":"労使協議会"},{"$f":"IF(データリスト!$V62=\"\",\"\",データリスト!$V62)","v":""},{"$nulls":17},{"$f":"IF(I344:N344=\"\",\"\",IF(J344:N344=\"\",I344,IF(K344:N344=\"\",I344&\"・\"&J344,IF(L344:N344=\"\",I344&\"・\"&J344&\"・\"&K344,IF(M344:N344=\"\",I344&\"・\"&J344&\"・\"&K344&\"・\"&L344,IF(N344=\"\",I344&\"・\"&J344&\"・\"&K344&\"・\"&L344&\"・\"&M344,I344&\"・\"&J344&\"・\"&K344&\"・\"&L344&\"・\"&M344&\"・\"&N344))))))","v":""},"","","","",""]
[null,{"$f":"データリスト!V$46","v":"労使協議会"},{"$f":"IF(データリスト!$V63=\"\",\"\",データリスト!$V63)","v":""},{"$nulls":17},{"$f":"IF(I345:N345=\"\",\"\",IF(J345:N345=\"\",I345,IF(K345:N345=\"\",I345&\"・\"&J345,IF(L345:N345=\"\",I345&\"・\"&J345&\"・\"&K345,IF(M345:N345=\"\",I345&\"・\"&J345&\"・\"&K345&\"・\"&L345,IF(N345=\"\",I345&\"・\"&J345&\"・\"&K345&\"・\"&L345&\"・\"&M345,I345&\"・\"&J345&\"・\"&K345&\"・\"&L345&\"・\"&M345&\"・\"&N345))))))","v":""},"","","","",""]
[null,{"$f":"データリスト!V$46","v":"労使協議会"},{"$f":"IF(データリスト!$V64=\"\",\"\",データリスト!$V64)","v":""},{"$nulls":17},{"$f":"IF(I346:N346=\"\",\"\",IF(J346:N346=\"\",I346,IF(K346:N346=\"\",I346&\"・\"&J346,IF(L346:N346=\"\",I346&\"・\"&J346&\"・\"&K346,IF(M346:N346=\"\",I346&\"・\"&J346&\"・\"&K346&\"・\"&L346,IF(N346=\"\",I346&\"・\"&J346&\"・\"&K346&\"・\"&L346&\"・\"&M346,I346&\"・\"&J346&\"・\"&K346&\"・\"&L346&\"・\"&M346&\"・\"&N346))))))","v":""},"","","","",""]
[null,{"$f":"データリスト!V$46","v":"労使協議会"},{"$f":"IF(データリスト!$V65=\"\",\"\",データリスト!$V65)","v":""},{"$nulls":17},{"$f":"IF(I347:N347=\"\",\"\",IF(J347:N347=\"\",I347,IF(K347:N347=\"\",I347&\"・\"&J347,IF(L347:N347=\"\",I347&\"・\"&J347&\"・\"&K347,IF(M347:N347=\"\",I347&\"・\"&J347&\"・\"&K347&\"・\"&L347,IF(N347=\"\",I347&\"・\"&J347&\"・\"&K347&\"・\"&L347&\"・\"&M347,I347&\"・\"&J347&\"・\"&K347&\"・\"&L347&\"・\"&M347&\"・\"&N347))))))","v":""},"","","","",""]
[null,{"$f":"データリスト!V$46","v":"労使協議会"},{"$f":"IF(データリスト!$V66=\"\",\"\",データリスト!$V66)","v":""},{"$nulls":17},{"$f":"IF(I348:N348=\"\",\"\",IF(J348:N348=\"\",I348,IF(K348:N348=\"\",I348&\"・\"&J348,IF(L348:N348=\"\",I348&\"・\"&J348&\"・\"&K348,IF(M348:N348=\"\",I348&\"・\"&J348&\"・\"&K348&\"・\"&L348,IF(N348=\"\",I348&\"・\"&J348&\"・\"&K348&\"・\"&L348&\"・\"&M348,I348&\"・\"&J348&\"・\"&K348&\"・\"&L348&\"・\"&M348&\"・\"&N348))))))","v":""},"","","","",""]
[null,{"$f":"データリスト!W$46","v":"安全衛生委員会"},{"$f":"IF(データリスト!$W47=\"\",\"\",データリスト!$W47)","v":"会社との日程調整"},{"$nulls":17},{"$f":"IF(I349:N349=\"\",\"\",IF(J349:N349=\"\",I349,IF(K349:N349=\"\",I349&\"・\"&J349,IF(L349:N349=\"\",I349&\"・\"&J349&\"・\"&K349,IF(M349:N349=\"\",I349&\"・\"&J349&\"・\"&K349&\"・\"&L349,IF(N349=\"\",I349&\"・\"&J349&\"・\"&K349&\"・\"&L349&\"・\"&M349,I349&\"・\"&J349&\"・\"&K349&\"・\"&L349&\"・\"&M349&\"・\"&N349))))))","v":""},"","","","",""]
[null,{"$f":"データリスト!W$46","v":"安全衛生委員会"},{"$f":"IF(データリスト!$W48=\"\",\"\",データリスト!$W48)","v":"分会執行委員会"},{"$nulls":17},{"$f":"IF(I350:N350=\"\",\"\",IF(J350:N350=\"\",I350,IF(K350:N350=\"\",I350&\"・\"&J350,IF(L350:N350=\"\",I350&\"・\"&J350&\"・\"&K350,IF(M350:N350=\"\",I350&\"・\"&J350&\"・\"&K350&\"・\"&L350,IF(N350=\"\",I350&\"・\"&J350&\"・\"&K350&\"・\"&L350&\"・\"&M350,I350&\"・\"&J350&\"・\"&K350&\"・\"&L350&\"・\"&M350&\"・\"&N350))))))","v":""},"","","","",""]
[null,{"$f":"データリスト!W$46","v":"安全衛生委員会"},{"$f":"IF(データリスト!$W49=\"\",\"\",データリスト!$W49)","v":"職場意見収集"},{"$nulls":17},{"$f":"IF(I351:N351=\"\",\"\",IF(J351:N351=\"\",I351,IF(K351:N351=\"\",I351&\"・\"&J351,IF(L351:N351=\"\",I351&\"・\"&J351&\"・\"&K351,IF(M351:N351=\"\",I351&\"・\"&J351&\"・\"&K351&\"・\"&L351,IF(N351=\"\",I351&\"・\"&J351&\"・\"&K351&\"・\"&L351&\"・\"&M351,I351&\"・\"&J351&\"・\"&K351&\"・\"&L351&\"・\"&M351&\"・\"&N351))))))","v":""},"","","","",""]
[null,{"$f":"データリスト!W$46","v":"安全衛生委員会"},{"$f":"IF(データリスト!$W50=\"\",\"\",データリスト!$W50)","v":"委員会の開催"},{"$nulls":17},{"$f":"IF(I352:N352=\"\",\"\",IF(J352:N352=\"\",I352,IF(K352:N352=\"\",I352&\"・\"&J352,IF(L352:N352=\"\",I352&\"・\"&J352&\"・\"&K352,IF(M352:N352=\"\",I352&\"・\"&J352&\"・\"&K352&\"・\"&L352,IF(N352=\"\",I352&\"・\"&J352&\"・\"&K352&\"・\"&L352&\"・\"&M352,I352&\"・\"&J352&\"・\"&K352&\"・\"&L352&\"・\"&M352&\"・\"&N352))))))","v":""},"","","","",""]
[null,{"$f":"データリスト!W$46","v":"安全衛生委員会"},{"$f":"IF(データリスト!$W51=\"\",\"\",データリスト!$W51)","v":"決定・確認事項周知"},{"$nulls":17},{"$f":"IF(I353:N353=\"\",\"\",IF(J353:N353=\"\",I353,IF(K353:N353=\"\",I353&\"・\"&J353,IF(L353:N353=\"\",I353&\"・\"&J353&\"・\"&K353,IF(M353:N353=\"\",I353&\"・\"&J353&\"・\"&K353&\"・\"&L353,IF(N353=\"\",I353&\"・\"&J353&\"・\"&K353&\"・\"&L353&\"・\"&M353,I353&\"・\"&J353&\"・\"&K353&\"・\"&L353&\"・\"&M353&\"・\"&N353))))))","v":""},"","","","",""]
[null,{"$f":"データリスト!W$46","v":"安全衛生委員会"},{"$f":"IF(データリスト!$W52=\"\",\"\",データリスト!$W52)","v":""},{"$nulls":17},{"$f":"IF(I354:N354=\"\",\"\",IF(J354:N354=\"\",I354,IF(K354:N354=\"\",I354&\"・\"&J354,IF(L354:N354=\"\",I354&\"・\"&J354&\"・\"&K354,IF(M354:N354=\"\",I354&\"・\"&J354&\"・\"&K354&\"・\"&L354,IF(N354=\"\",I354&\"・\"&J354&\"・\"&K354&\"・\"&L354&\"・\"&M354,I354&\"・\"&J354&\"・\"&K354&\"・\"&L354&\"・\"&M354&\"・\"&N354))))))","v":""},"","","","",""]
[null,{"$f":"データリスト!W$46","v":"安全衛生委員会"},{"$f":"IF(データリスト!$W53=\"\",\"\",データリスト!$W53)","v":""},{"$nulls":17},{"$f":"IF(I355:N355=\"\",\"\",IF(J355:N355=\"\",I355,IF(K355:N355=\"\",I355&\"・\"&J355,IF(L355:N355=\"\",I355&\"・\"&J355&\"・\"&K355,IF(M355:N355=\"\",I355&\"・\"&J355&\"・\"&K355&\"・\"&L355,IF(N355=\"\",I355&\"・\"&J355&\"・\"&K355&\"・\"&L355&\"・\"&M355,I355&\"・\"&J355&\"・\"&K355&\"・\"&L355&\"・\"&M355&\"・\"&N355))))))","v":""},"","","","",""]
[null,{"$f":"データリスト!W$46","v":"安全衛生委員会"},{"$f":"IF(データリスト!$W54=\"\",\"\",データリスト!$W54)","v":""},{"$nulls":17},{"$f":"IF(I356:N356=\"\",\"\",IF(J356:N356=\"\",I356,IF(K356:N356=\"\",I356&\"・\"&J356,IF(L356:N356=\"\",I356&\"・\"&J356&\"・\"&K356,IF(M356:N356=\"\",I356&\"・\"&J356&\"・\"&K356&\"・\"&L356,IF(N356=\"\",I356&\"・\"&J356&\"・\"&K356&\"・\"&L356&\"・\"&M356,I356&\"・\"&J356&\"・\"&K356&\"・\"&L356&\"・\"&M356&\"・\"&N356))))))","v":""},"","","","",""]
[null,{"$f":"データリスト!W$46","v":"安全衛生委員会"},{"$f":"IF(データリスト!$W55=\"\",\"\",データリスト!$W55)","v":""},{"$nulls":17},{"$f":"IF(I357:N357=\"\",\"\",IF(J357:N357=\"\",I357,IF(K357:N357=\"\",I357&\"・\"&J357,IF(L357:N357=\"\",I357&\"・\"&J357&\"・\"&K357,IF(M357:N357=\"\",I357&\"・\"&J357&\"・\"&K357&\"・\"&L357,IF(N357=\"\",I357&\"・\"&J357&\"・\"&K357&\"・\"&L357&\"・\"&M357,I357&\"・\"&J357&\"・\"&K357&\"・\"&L357&\"・\"&M357&\"・\"&N357))))))","v":""},"","","","",""]
[null,{"$f":"データリスト!W$46","v":"安全衛生委員会"},{"$f":"IF(データリスト!$W56=\"\",\"\",データリスト!$W56)","v":""},{"$nulls":17},{"$f":"IF(I358:N358=\"\",\"\",IF(J358:N358=\"\",I358,IF(K358:N358=\"\",I358&\"・\"&J358,IF(L358:N358=\"\",I358&\"・\"&J358&\"・\"&K358,IF(M358:N358=\"\",I358&\"・\"&J358&\"・\"&K358&\"・\"&L358,IF(N358=\"\",I358&\"・\"&J358&\"・\"&K358&\"・\"&L358&\"・\"&M358,I358&\"・\"&J358&\"・\"&K358&\"・\"&L358&\"・\"&M358&\"・\"&N358))))))","v":""},"","","","",""]
[null,{"$f":"データリスト!W$46","v":"安全衛生委員会"},{"$f":"IF(データリスト!$W57=\"\",\"\",データリスト!$W57)","v":""},{"$nulls":17},{"$f":"IF(I359:N359=\"\",\"\",IF(J359:N359=\"\",I359,IF(K359:N359=\"\",I359&\"・\"&J359,IF(L359:N359=\"\",I359&\"・\"&J359&\"・\"&K359,IF(M359:N359=\"\",I359&\"・\"&J359&\"・\"&K359&\"・\"&L359,IF(N359=\"\",I359&\"・\"&J359&\"・\"&K359&\"・\"&L359&\"・\"&M359,I359&\"・\"&J359&\"・\"&K359&\"・\"&L359&\"・\"&M359&\"・\"&N359))))))","v":""},"","","","",""]
[null,{"$f":"データリスト!W$46","v":"安全衛生委員会"},{"$f":"IF(データリスト!$W58=\"\",\"\",データリスト!$W58)","v":""},{"$nulls":17},{"$f":"IF(I360:N360=\"\",\"\",IF(J360:N360=\"\",I360,IF(K360:N360=\"\",I360&\"・\"&J360,IF(L360:N360=\"\",I360&\"・\"&J360&\"・\"&K360,IF(M360:N360=\"\",I360&\"・\"&J360&\"・\"&K360&\"・\"&L360,IF(N360=\"\",I360&\"・\"&J360&\"・\"&K360&\"・\"&L360&\"・\"&M360,I360&\"・\"&J360&\"・\"&K360&\"・\"&L360&\"・\"&M360&\"・\"&N360))))))","v":""},"","","","",""]
[null,{"$f":"データリスト!W$46","v":"安全衛生委員会"},{"$f":"IF(データリスト!$W59=\"\",\"\",データリスト!$W59)","v":""},{"$nulls":17},{"$f":"IF(I361:N361=\"\",\"\",IF(J361:N361=\"\",I361,IF(K361:N361=\"\",I361&\"・\"&J361,IF(L361:N361=\"\",I361&\"・\"&J361&\"・\"&K361,IF(M361:N361=\"\",I361&\"・\"&J361&\"・\"&K361&\"・\"&L361,IF(N361=\"\",I361&\"・\"&J361&\"・\"&K361&\"・\"&L361&\"・\"&M361,I361&\"・\"&J361&\"・\"&K361&\"・\"&L361&\"・\"&M361&\"・\"&N361))))))","v":""},"","","","",""]
[null,{"$f":"データリスト!W$46","v":"安全衛生委員会"},{"$f":"IF(データリスト!$W60=\"\",\"\",データリスト!$W60)","v":""},{"$nulls":17},{"$f":"IF(I362:N362=\"\",\"\",IF(J362:N362=\"\",I362,IF(K362:N362=\"\",I362&\"・\"&J362,IF(L362:N362=\"\",I362&\"・\"&J362&\"・\"&K362,IF(M362:N362=\"\",I362&\"・\"&J362&\"・\"&K362&\"・\"&L362,IF(N362=\"\",I362&\"・\"&J362&\"・\"&K362&\"・\"&L362&\"・\"&M362,I362&\"・\"&J362&\"・\"&K362&\"・\"&L362&\"・\"&M362&\"・\"&N362))))))","v":""},"","","","",""]
[null,{"$f":"データリスト!W$46","v":"安全衛生委員会"},{"$f":"IF(データリスト!$W61=\"\",\"\",データリスト!$W61)","v":""},{"$nulls":17},{"$f":"IF(I363:N363=\"\",\"\",IF(J363:N363=\"\",I363,IF(K363:N363=\"\",I363&\"・\"&J363,IF(L363:N363=\"\",I363&\"・\"&J363&\"・\"&K363,IF(M363:N363=\"\",I363&\"・\"&J363&\"・\"&K363&\"・\"&L363,IF(N363=\"\",I363&\"・\"&J363&\"・\"&K363&\"・\"&L363&\"・\"&M363,I363&\"・\"&J363&\"・\"&K363&\"・\"&L363&\"・\"&M363&\"・\"&N363))))))","v":""},"","","","",""]
[null,{"$f":"データリスト!W$46","v":"安全衛生委員会"},{"$f":"IF(データリスト!$W62=\"\",\"\",データリスト!$W62)","v":""},{"$nulls":17},{"$f":"IF(I364:N364=\"\",\"\",IF(J364:N364=\"\",I364,IF(K364:N364=\"\",I364&\"・\"&J364,IF(L364:N364=\"\",I364&\"・\"&J364&\"・\"&K364,IF(M364:N364=\"\",I364&\"・\"&J364&\"・\"&K364&\"・\"&L364,IF(N364=\"\",I364&\"・\"&J364&\"・\"&K364&\"・\"&L364&\"・\"&M364,I364&\"・\"&J364&\"・\"&K364&\"・\"&L364&\"・\"&M364&\"・\"&N364))))))","v":""},"","","","",""]
[null,{"$f":"データリスト!W$46","v":"安全衛生委員会"},{"$f":"IF(データリスト!$W63=\"\",\"\",データリスト!$W63)","v":""},{"$nulls":17},{"$f":"IF(I365:N365=\"\",\"\",IF(J365:N365=\"\",I365,IF(K365:N365=\"\",I365&\"・\"&J365,IF(L365:N365=\"\",I365&\"・\"&J365&\"・\"&K365,IF(M365:N365=\"\",I365&\"・\"&J365&\"・\"&K365&\"・\"&L365,IF(N365=\"\",I365&\"・\"&J365&\"・\"&K365&\"・\"&L365&\"・\"&M365,I365&\"・\"&J365&\"・\"&K365&\"・\"&L365&\"・\"&M365&\"・\"&N365))))))","v":""},"","","","",""]
[null,{"$f":"データリスト!W$46","v":"安全衛生委員会"},{"$f":"IF(データリスト!$W64=\"\",\"\",データリスト!$W64)","v":""},{"$nulls":17},{"$f":"IF(I366:N366=\"\",\"\",IF(J366:N366=\"\",I366,IF(K366:N366=\"\",I366&\"・\"&J366,IF(L366:N366=\"\",I366&\"・\"&J366&\"・\"&K366,IF(M366:N366=\"\",I366&\"・\"&J366&\"・\"&K366&\"・\"&L366,IF(N366=\"\",I366&\"・\"&J366&\"・\"&K366&\"・\"&L366&\"・\"&M366,I366&\"・\"&J366&\"・\"&K366&\"・\"&L366&\"・\"&M366&\"・\"&N366))))))","v":""},"","","","",""]
[null,{"$f":"データリスト!W$46","v":"安全衛生委員会"},{"$f":"IF(データリスト!$W65=\"\",\"\",データリスト!$W65)","v":""},{"$nulls":17},{"$f":"IF(I367:N367=\"\",\"\",IF(J367:N367=\"\",I367,IF(K367:N367=\"\",I367&\"・\"&J367,IF(L367:N367=\"\",I367&\"・\"&J367&\"・\"&K367,IF(M367:N367=\"\",I367&\"・\"&J367&\"・\"&K367&\"・\"&L367,IF(N367=\"\",I367&\"・\"&J367&\"・\"&K367&\"・\"&L367&\"・\"&M367,I367&\"・\"&J367&\"・\"&K367&\"・\"&L367&\"・\"&M367&\"・\"&N367))))))","v":""},"","","","",""]
[null,{"$f":"データリスト!W$46","v":"安全衛生委員会"},{"$f":"IF(データリスト!$W66=\"\",\"\",データリスト!$W66)","v":""},{"$nulls":17},{"$f":"IF(I368:N368=\"\",\"\",IF(J368:N368=\"\",I368,IF(K368:N368=\"\",I368&\"・\"&J368,IF(L368:N368=\"\",I368&\"・\"&J368&\"・\"&K368,IF(M368:N368=\"\",I368&\"・\"&J368&\"・\"&K368&\"・\"&L368,IF(N368=\"\",I368&\"・\"&J368&\"・\"&K368&\"・\"&L368&\"・\"&M368,I368&\"・\"&J368&\"・\"&K368&\"・\"&L368&\"・\"&M368&\"・\"&N368))))))","v":""},"","","","",""]
[null,{"$f":"データリスト!X$46","v":"労使パトロール"},{"$f":"IF(データリスト!$X47=\"\",\"\",データリスト!$X47)","v":"会社との日程調整"},{"$nulls":17},{"$f":"IF(I369:N369=\"\",\"\",IF(J369:N369=\"\",I369,IF(K369:N369=\"\",I369&\"・\"&J369,IF(L369:N369=\"\",I369&\"・\"&J369&\"・\"&K369,IF(M369:N369=\"\",I369&\"・\"&J369&\"・\"&K369&\"・\"&L369,IF(N369=\"\",I369&\"・\"&J369&\"・\"&K369&\"・\"&L369&\"・\"&M369,I369&\"・\"&J369&\"・\"&K369&\"・\"&L369&\"・\"&M369&\"・\"&N369))))))","v":""},"","","","",""]
[null,{"$f":"データリスト!X$46","v":"労使パトロール"},{"$f":"IF(データリスト!$X48=\"\",\"\",データリスト!$X48)","v":"パトロール"},{"$nulls":17},{"$f":"IF(I370:N370=\"\",\"\",IF(J370:N370=\"\",I370,IF(K370:N370=\"\",I370&\"・\"&J370,IF(L370:N370=\"\",I370&\"・\"&J370&\"・\"&K370,IF(M370:N370=\"\",I370&\"・\"&J370&\"・\"&K370&\"・\"&L370,IF(N370=\"\",I370&\"・\"&J370&\"・\"&K370&\"・\"&L370&\"・\"&M370,I370&\"・\"&J370&\"・\"&K370&\"・\"&L370&\"・\"&M370&\"・\"&N370))))))","v":""},"","","","",""]
[null,{"$f":"データリスト!X$46","v":"労使パトロール"},{"$f":"IF(データリスト!$X49=\"\",\"\",データリスト!$X49)","v":"結果の確認"},{"$nulls":17},{"$f":"IF(I371:N371=\"\",\"\",IF(J371:N371=\"\",I371,IF(K371:N371=\"\",I371&\"・\"&J371,IF(L371:N371=\"\",I371&\"・\"&J371&\"・\"&K371,IF(M371:N371=\"\",I371&\"・\"&J371&\"・\"&K371&\"・\"&L371,IF(N371=\"\",I371&\"・\"&J371&\"・\"&K371&\"・\"&L371&\"・\"&M371,I371&\"・\"&J371&\"・\"&K371&\"・\"&L371&\"・\"&M371&\"・\"&N371))))))","v":""},"","","","",""]
[null,{"$f":"データリスト!X$46","v":"労使パトロール"},{"$f":"IF(データリスト!$X50=\"\",\"\",データリスト!$X50)","v":""},{"$nulls":17},{"$f":"IF(I372:N372=\"\",\"\",IF(J372:N372=\"\",I372,IF(K372:N372=\"\",I372&\"・\"&J372,IF(L372:N372=\"\",I372&\"・\"&J372&\"・\"&K372,IF(M372:N372=\"\",I372&\"・\"&J372&\"・\"&K372&\"・\"&L372,IF(N372=\"\",I372&\"・\"&J372&\"・\"&K372&\"・\"&L372&\"・\"&M372,I372&\"・\"&J372&\"・\"&K372&\"・\"&L372&\"・\"&M372&\"・\"&N372))))))","v":""},"","","","",""]
[null,{"$f":"データリスト!X$46","v":"労使パトロール"},{"$f":"IF(データリスト!$X51=\"\",\"\",データリスト!$X51)","v":""},{"$nulls":17},{"$f":"IF(I373:N373=\"\",\"\",IF(J373:N373=\"\",I373,IF(K373:N373=\"\",I373&\"・\"&J373,IF(L373:N373=\"\",I373&\"・\"&J373&\"・\"&K373,IF(M373:N373=\"\",I373&\"・\"&J373&\"・\"&K373&\"・\"&L373,IF(N373=\"\",I373&\"・\"&J373&\"・\"&K373&\"・\"&L373&\"・\"&M373,I373&\"・\"&J373&\"・\"&K373&\"・\"&L373&\"・\"&M373&\"・\"&N373))))))","v":""},"","","","",""]
[null,{"$f":"データリスト!X$46","v":"労使パトロール"},{"$f":"IF(データリスト!$X52=\"\",\"\",データリスト!$X52)","v":""},{"$nulls":17},{"$f":"IF(I374:N374=\"\",\"\",IF(J374:N374=\"\",I374,IF(K374:N374=\"\",I374&\"・\"&J374,IF(L374:N374=\"\",I374&\"・\"&J374&\"・\"&K374,IF(M374:N374=\"\",I374&\"・\"&J374&\"・\"&K374&\"・\"&L374,IF(N374=\"\",I374&\"・\"&J374&\"・\"&K374&\"・\"&L374&\"・\"&M374,I374&\"・\"&J374&\"・\"&K374&\"・\"&L374&\"・\"&M374&\"・\"&N374))))))","v":""},"","","","",""]
[null,{"$f":"データリスト!X$46","v":"労使パトロール"},{"$f":"IF(データリスト!$X53=\"\",\"\",データリスト!$X53)","v":""},{"$nulls":17},{"$f":"IF(I375:N375=\"\",\"\",IF(J375:N375=\"\",I375,IF(K375:N375=\"\",I375&\"・\"&J375,IF(L375:N375=\"\",I375&\"・\"&J375&\"・\"&K375,IF(M375:N375=\"\",I375&\"・\"&J375&\"・\"&K375&\"・\"&L375,IF(N375=\"\",I375&\"・\"&J375&\"・\"&K375&\"・\"&L375&\"・\"&M375,I375&\"・\"&J375&\"・\"&K375&\"・\"&L375&\"・\"&M375&\"・\"&N375))))))","v":""},"","","","",""]
[null,{"$f":"データリスト!X$46","v":"労使パトロール"},{"$f":"IF(データリスト!$X54=\"\",\"\",データリスト!$X54)","v":""},{"$nulls":17},{"$f":"IF(I376:N376=\"\",\"\",IF(J376:N376=\"\",I376,IF(K376:N376=\"\",I376&\"・\"&J376,IF(L376:N376=\"\",I376&\"・\"&J376&\"・\"&K376,IF(M376:N376=\"\",I376&\"・\"&J376&\"・\"&K376&\"・\"&L376,IF(N376=\"\",I376&\"・\"&J376&\"・\"&K376&\"・\"&L376&\"・\"&M376,I376&\"・\"&J376&\"・\"&K376&\"・\"&L376&\"・\"&M376&\"・\"&N376))))))","v":""},"","","","",""]
[null,{"$f":"データリスト!X$46","v":"労使パトロール"},{"$f":"IF(データリスト!$X55=\"\",\"\",データリスト!$X55)","v":""},{"$nulls":17},{"$f":"IF(I377:N377=\"\",\"\",IF(J377:N377=\"\",I377,IF(K377:N377=\"\",I377&\"・\"&J377,IF(L377:N377=\"\",I377&\"・\"&J377&\"・\"&K377,IF(M377:N377=\"\",I377&\"・\"&J377&\"・\"&K377&\"・\"&L377,IF(N377=\"\",I377&\"・\"&J377&\"・\"&K377&\"・\"&L377&\"・\"&M377,I377&\"・\"&J377&\"・\"&K377&\"・\"&L377&\"・\"&M377&\"・\"&N377))))))","v":""},"","","","",""]
[null,{"$f":"データリスト!X$46","v":"労使パトロール"},{"$f":"IF(データリスト!$X56=\"\",\"\",データリスト!$X56)","v":""},{"$nulls":17},{"$f":"IF(I378:N378=\"\",\"\",IF(J378:N378=\"\",I378,IF(K378:N378=\"\",I378&\"・\"&J378,IF(L378:N378=\"\",I378&\"・\"&J378&\"・\"&K378,IF(M378:N378=\"\",I378&\"・\"&J378&\"・\"&K378&\"・\"&L378,IF(N378=\"\",I378&\"・\"&J378&\"・\"&K378&\"・\"&L378&\"・\"&M378,I378&\"・\"&J378&\"・\"&K378&\"・\"&L378&\"・\"&M378&\"・\"&N378))))))","v":""},"","","","",""]
[null,{"$f":"データリスト!X$46","v":"労使パトロール"},{"$f":"IF(データリスト!$X57=\"\",\"\",データリスト!$X57)","v":""},{"$nulls":17},{"$f":"IF(I379:N379=\"\",\"\",IF(J379:N379=\"\",I379,IF(K379:N379=\"\",I379&\"・\"&J379,IF(L379:N379=\"\",I379&\"・\"&J379&\"・\"&K379,IF(M379:N379=\"\",I379&\"・\"&J379&\"・\"&K379&\"・\"&L379,IF(N379=\"\",I379&\"・\"&J379&\"・\"&K379&\"・\"&L379&\"・\"&M379,I379&\"・\"&J379&\"・\"&K379&\"・\"&L379&\"・\"&M379&\"・\"&N379))))))","v":""},"","","","",""]
[null,{"$f":"データリスト!X$46","v":"労使パトロール"},{"$f":"IF(データリスト!$X58=\"\",\"\",データリスト!$X58)","v":""},{"$nulls":17},{"$f":"IF(I380:N380=\"\",\"\",IF(J380:N380=\"\",I380,IF(K380:N380=\"\",I380&\"・\"&J380,IF(L380:N380=\"\",I380&\"・\"&J380&\"・\"&K380,IF(M380:N380=\"\",I380&\"・\"&J380&\"・\"&K380&\"・\"&L380,IF(N380=\"\",I380&\"・\"&J380&\"・\"&K380&\"・\"&L380&\"・\"&M380,I380&\"・\"&J380&\"・\"&K380&\"・\"&L380&\"・\"&M380&\"・\"&N380))))))","v":""},"","","","",""]
[null,{"$f":"データリスト!X$46","v":"労使パトロール"},{"$f":"IF(データリスト!$X59=\"\",\"\",データリスト!$X59)","v":""},{"$nulls":17},{"$f":"IF(I381:N381=\"\",\"\",IF(J381:N381=\"\",I381,IF(K381:N381=\"\",I381&\"・\"&J381,IF(L381:N381=\"\",I381&\"・\"&J381&\"・\"&K381,IF(M381:N381=\"\",I381&\"・\"&J381&\"・\"&K381&\"・\"&L381,IF(N381=\"\",I381&\"・\"&J381&\"・\"&K381&\"・\"&L381&\"・\"&M381,I381&\"・\"&J381&\"・\"&K381&\"・\"&L381&\"・\"&M381&\"・\"&N381))))))","v":""},"","","","",""]
[null,{"$f":"データリスト!X$46","v":"労使パトロール"},{"$f":"IF(データリスト!$X60=\"\",\"\",データリスト!$X60)","v":""},{"$nulls":17},{"$f":"IF(I382:N382=\"\",\"\",IF(J382:N382=\"\",I382,IF(K382:N382=\"\",I382&\"・\"&J382,IF(L382:N382=\"\",I382&\"・\"&J382&\"・\"&K382,IF(M382:N382=\"\",I382&\"・\"&J382&\"・\"&K382&\"・\"&L382,IF(N382=\"\",I382&\"・\"&J382&\"・\"&K382&\"・\"&L382&\"・\"&M382,I382&\"・\"&J382&\"・\"&K382&\"・\"&L382&\"・\"&M382&\"・\"&N382))))))","v":""},"","","","",""]
[null,{"$f":"データリスト!X$46","v":"労使パトロール"},{"$f":"IF(データリスト!$X61=\"\",\"\",データリスト!$X61)","v":""},{"$nulls":17},{"$f":"IF(I383:N383=\"\",\"\",IF(J383:N383=\"\",I383,IF(K383:N383=\"\",I383&\"・\"&J383,IF(L383:N383=\"\",I383&\"・\"&J383&\"・\"&K383,IF(M383:N383=\"\",I383&\"・\"&J383&\"・\"&K383&\"・\"&L383,IF(N383=\"\",I383&\"・\"&J383&\"・\"&K383&\"・\"&L383&\"・\"&M383,I383&\"・\"&J383&\"・\"&K383&\"・\"&L383&\"・\"&M383&\"・\"&N383))))))","v":""},"","","","",""]
[null,{"$f":"データリスト!X$46","v":"労使パトロール"},{"$f":"IF(データリスト!$X62=\"\",\"\",データリスト!$X62)","v":""},{"$nulls":17},{"$f":"IF(I384:N384=\"\",\"\",IF(J384:N384=\"\",I384,IF(K384:N384=\"\",I384&\"・\"&J384,IF(L384:N384=\"\",I384&\"・\"&J384&\"・\"&K384,IF(M384:N384=\"\",I384&\"・\"&J384&\"・\"&K384&\"・\"&L384,IF(N384=\"\",I384&\"・\"&J384&\"・\"&K384&\"・\"&L384&\"・\"&M384,I384&\"・\"&J384&\"・\"&K384&\"・\"&L384&\"・\"&M384&\"・\"&N384))))))","v":""},"","","","",""]
[null,{"$f":"データリスト!X$46","v":"労使パトロール"},{"$f":"IF(データリスト!$X63=\"\",\"\",データリスト!$X63)","v":""},{"$nulls":17},{"$f":"IF(I385:N385=\"\",\"\",IF(J385:N385=\"\",I385,IF(K385:N385=\"\",I385&\"・\"&J385,IF(L385:N385=\"\",I385&\"・\"&J385&\"・\"&K385,IF(M385:N385=\"\",I385&\"・\"&J385&\"・\"&K385&\"・\"&L385,IF(N385=\"\",I385&\"・\"&J385&\"・\"&K385&\"・\"&L385&\"・\"&M385,I385&\"・\"&J385&\"・\"&K385&\"・\"&L385&\"・\"&M385&\"・\"&N385))))))","v":""},"","","","",""]
[null,{"$f":"データリスト!X$46","v":"労使パトロール"},{"$f":"IF(データリスト!$X64=\"\",\"\",データリスト!$X64)","v":""},{"$nulls":17},{"$f":"IF(I386:N386=\"\",\"\",IF(J386:N386=\"\",I386,IF(K386:N386=\"\",I386&\"・\"&J386,IF(L386:N386=\"\",I386&\"・\"&J386&\"・\"&K386,IF(M386:N386=\"\",I386&\"・\"&J386&\"・\"&K386&\"・\"&L386,IF(N386=\"\",I386&\"・\"&J386&\"・\"&K386&\"・\"&L386&\"・\"&M386,I386&\"・\"&J386&\"・\"&K386&\"・\"&L386&\"・\"&M386&\"・\"&N386))))))","v":""},"","","","",""]
[null,{"$f":"データリスト!X$46","v":"労使パトロール"},{"$f":"IF(データリスト!$X65=\"\",\"\",データリスト!$X65)","v":""},{"$nulls":17},{"$f":"IF(I387:N387=\"\",\"\",IF(J387:N387=\"\",I387,IF(K387:N387=\"\",I387&\"・\"&J387,IF(L387:N387=\"\",I387&\"・\"&J387&\"・\"&K387,IF(M387:N387=\"\",I387&\"・\"&J387&\"・\"&K387&\"・\"&L387,IF(N387=\"\",I387&\"・\"&J387&\"・\"&K387&\"・\"&L387&\"・\"&M387,I387&\"・\"&J387&\"・\"&K387&\"・\"&L387&\"・\"&M387&\"・\"&N387))))))","v":""},"","","","",""]
[null,{"$f":"データリスト!X$46","v":"労使パトロール"},{"$f":"IF(データリスト!$X66=\"\",\"\",データリスト!$X66)","v":""},{"$nulls":17},{"$f":"IF(I388:N388=\"\",\"\",IF(J388:N388=\"\",I388,IF(K388:N388=\"\",I388&\"・\"&J388,IF(L388:N388=\"\",I388&\"・\"&J388&\"・\"&K388,IF(M388:N388=\"\",I388&\"・\"&J388&\"・\"&K388&\"・\"&L388,IF(N388=\"\",I388&\"・\"&J388&\"・\"&K388&\"・\"&L388&\"・\"&M388,I388&\"・\"&J388&\"・\"&K388&\"・\"&L388&\"・\"&M388&\"・\"&N388))))))","v":""},"","","","",""]
[null,{"$f":"データリスト!Y$46","v":"三六協定"},{"$f":"IF(データリスト!$Y47=\"\",\"\",データリスト!$Y47)","v":"次年度三六協定説明"},{"$nulls":17},{"$f":"IF(I389:N389=\"\",\"\",IF(J389:N389=\"\",I389,IF(K389:N389=\"\",I389&\"・\"&J389,IF(L389:N389=\"\",I389&\"・\"&J389&\"・\"&K389,IF(M389:N389=\"\",I389&\"・\"&J389&\"・\"&K389&\"・\"&L389,IF(N389=\"\",I389&\"・\"&J389&\"・\"&K389&\"・\"&L389&\"・\"&M389,I389&\"・\"&J389&\"・\"&K389&\"・\"&L389&\"・\"&M389&\"・\"&N389))))))","v":""},"","","","",""]
[null,{"$f":"データリスト!Y$46","v":"三六協定"},{"$f":"IF(データリスト!$Y48=\"\",\"\",データリスト!$Y48)","v":"締結"},{"$nulls":17},{"$f":"IF(I390:N390=\"\",\"\",IF(J390:N390=\"\",I390,IF(K390:N390=\"\",I390&\"・\"&J390,IF(L390:N390=\"\",I390&\"・\"&J390&\"・\"&K390,IF(M390:N390=\"\",I390&\"・\"&J390&\"・\"&K390&\"・\"&L390,IF(N390=\"\",I390&\"・\"&J390&\"・\"&K390&\"・\"&L390&\"・\"&M390,I390&\"・\"&J390&\"・\"&K390&\"・\"&L390&\"・\"&M390&\"・\"&N390))))))","v":""},"","","","",""]
[null,{"$f":"データリスト!Y$46","v":"三六協定"},{"$f":"IF(データリスト!$Y49=\"\",\"\",データリスト!$Y49)","v":"締結事項報告"},{"$nulls":17},{"$f":"IF(I391:N391=\"\",\"\",IF(J391:N391=\"\",I391,IF(K391:N391=\"\",I391&\"・\"&J391,IF(L391:N391=\"\",I391&\"・\"&J391&\"・\"&K391,IF(M391:N391=\"\",I391&\"・\"&J391&\"・\"&K391&\"・\"&L391,IF(N391=\"\",I391&\"・\"&J391&\"・\"&K391&\"・\"&L391&\"・\"&M391,I391&\"・\"&J391&\"・\"&K391&\"・\"&L391&\"・\"&M391&\"・\"&N391))))))","v":""},"","","","",""]
[null,{"$f":"データリスト!Y$46","v":"三六協定"},{"$f":"IF(データリスト!$Y50=\"\",\"\",データリスト!$Y50)","v":"職場周知"},{"$nulls":17},{"$f":"IF(I392:N392=\"\",\"\",IF(J392:N392=\"\",I392,IF(K392:N392=\"\",I392&\"・\"&J392,IF(L392:N392=\"\",I392&\"・\"&J392&\"・\"&K392,IF(M392:N392=\"\",I392&\"・\"&J392&\"・\"&K392&\"・\"&L392,IF(N392=\"\",I392&\"・\"&J392&\"・\"&K392&\"・\"&L392&\"・\"&M392,I392&\"・\"&J392&\"・\"&K392&\"・\"&L392&\"・\"&M392&\"・\"&N392))))))","v":""},"","","","",""]
[null,{"$f":"データリスト!Y$46","v":"三六協定"},{"$f":"IF(データリスト!$Y51=\"\",\"\",データリスト!$Y51)","v":""},{"$nulls":17},{"$f":"IF(I393:N393=\"\",\"\",IF(J393:N393=\"\",I393,IF(K393:N393=\"\",I393&\"・\"&J393,IF(L393:N393=\"\",I393&\"・\"&J393&\"・\"&K393,IF(M393:N393=\"\",I393&\"・\"&J393&\"・\"&K393&\"・\"&L393,IF(N393=\"\",I393&\"・\"&J393&\"・\"&K393&\"・\"&L393&\"・\"&M393,I393&\"・\"&J393&\"・\"&K393&\"・\"&L393&\"・\"&M393&\"・\"&N393))))))","v":""},"","","","",""]
[null,{"$f":"データリスト!Y$46","v":"三六協定"},{"$f":"IF(データリスト!$Y52=\"\",\"\",データリスト!$Y52)","v":""},{"$nulls":17},{"$f":"IF(I394:N394=\"\",\"\",IF(J394:N394=\"\",I394,IF(K394:N394=\"\",I394&\"・\"&J394,IF(L394:N394=\"\",I394&\"・\"&J394&\"・\"&K394,IF(M394:N394=\"\",I394&\"・\"&J394&\"・\"&K394&\"・\"&L394,IF(N394=\"\",I394&\"・\"&J394&\"・\"&K394&\"・\"&L394&\"・\"&M394,I394&\"・\"&J394&\"・\"&K394&\"・\"&L394&\"・\"&M394&\"・\"&N394))))))","v":""},"","","","",""]
[null,{"$f":"データリスト!Y$46","v":"三六協定"},{"$f":"IF(データリスト!$Y53=\"\",\"\",データリスト!$Y53)","v":""},{"$nulls":17},{"$f":"IF(I395:N395=\"\",\"\",IF(J395:N395=\"\",I395,IF(K395:N395=\"\",I395&\"・\"&J395,IF(L395:N395=\"\",I395&\"・\"&J395&\"・\"&K395,IF(M395:N395=\"\",I395&\"・\"&J395&\"・\"&K395&\"・\"&L395,IF(N395=\"\",I395&\"・\"&J395&\"・\"&K395&\"・\"&L395&\"・\"&M395,I395&\"・\"&J395&\"・\"&K395&\"・\"&L395&\"・\"&M395&\"・\"&N395))))))","v":""},"","","","",""]
[null,{"$f":"データリスト!Y$46","v":"三六協定"},{"$f":"IF(データリスト!$Y54=\"\",\"\",データリスト!$Y54)","v":""},{"$nulls":17},{"$f":"IF(I396:N396=\"\",\"\",IF(J396:N396=\"\",I396,IF(K396:N396=\"\",I396&\"・\"&J396,IF(L396:N396=\"\",I396&\"・\"&J396&\"・\"&K396,IF(M396:N396=\"\",I396&\"・\"&J396&\"・\"&K396&\"・\"&L396,IF(N396=\"\",I396&\"・\"&J396&\"・\"&K396&\"・\"&L396&\"・\"&M396,I396&\"・\"&J396&\"・\"&K396&\"・\"&L396&\"・\"&M396&\"・\"&N396))))))","v":""},"","","","",""]
[null,{"$f":"データリスト!Y$46","v":"三六協定"},{"$f":"IF(データリスト!$Y55=\"\",\"\",データリスト!$Y55)","v":""},{"$nulls":17},{"$f":"IF(I397:N397=\"\",\"\",IF(J397:N397=\"\",I397,IF(K397:N397=\"\",I397&\"・\"&J397,IF(L397:N397=\"\",I397&\"・\"&J397&\"・\"&K397,IF(M397:N397=\"\",I397&\"・\"&J397&\"・\"&K397&\"・\"&L397,IF(N397=\"\",I397&\"・\"&J397&\"・\"&K397&\"・\"&L397&\"・\"&M397,I397&\"・\"&J397&\"・\"&K397&\"・\"&L397&\"・\"&M397&\"・\"&N397))))))","v":""},"","","","",""]
[null,{"$f":"データリスト!Y$46","v":"三六協定"},{"$f":"IF(データリスト!$Y56=\"\",\"\",データリスト!$Y56)","v":""},{"$nulls":17},{"$f":"IF(I398:N398=\"\",\"\",IF(J398:N398=\"\",I398,IF(K398:N398=\"\",I398&\"・\"&J398,IF(L398:N398=\"\",I398&\"・\"&J398&\"・\"&K398,IF(M398:N398=\"\",I398&\"・\"&J398&\"・\"&K398&\"・\"&L398,IF(N398=\"\",I398&\"・\"&J398&\"・\"&K398&\"・\"&L398&\"・\"&M398,I398&\"・\"&J398&\"・\"&K398&\"・\"&L398&\"・\"&M398&\"・\"&N398))))))","v":""},"","","","",""]
[null,{"$f":"データリスト!Y$46","v":"三六協定"},{"$f":"IF(データリスト!$Y57=\"\",\"\",データリスト!$Y57)","v":""},{"$nulls":17},{"$f":"IF(I399:N399=\"\",\"\",IF(J399:N399=\"\",I399,IF(K399:N399=\"\",I399&\"・\"&J399,IF(L399:N399=\"\",I399&\"・\"&J399&\"・\"&K399,IF(M399:N399=\"\",I399&\"・\"&J399&\"・\"&K399&\"・\"&L399,IF(N399=\"\",I399&\"・\"&J399&\"・\"&K399&\"・\"&L399&\"・\"&M399,I399&\"・\"&J399&\"・\"&K399&\"・\"&L399&\"・\"&M399&\"・\"&N399))))))","v":""},"","","","",""]
[null,{"$f":"データリスト!Y$46","v":"三六協定"},{"$f":"IF(データリスト!$Y58=\"\",\"\",データリスト!$Y58)","v":""},{"$nulls":17},{"$f":"IF(I400:N400=\"\",\"\",IF(J400:N400=\"\",I400,IF(K400:N400=\"\",I400&\"・\"&J400,IF(L400:N400=\"\",I400&\"・\"&J400&\"・\"&K400,IF(M400:N400=\"\",I400&\"・\"&J400&\"・\"&K400&\"・\"&L400,IF(N400=\"\",I400&\"・\"&J400&\"・\"&K400&\"・\"&L400&\"・\"&M400,I400&\"・\"&J400&\"・\"&K400&\"・\"&L400&\"・\"&M400&\"・\"&N400))))))","v":""},"","","","",""]
[null,{"$f":"データリスト!Y$46","v":"三六協定"},{"$f":"IF(データリスト!$Y59=\"\",\"\",データリスト!$Y59)","v":""},{"$nulls":17},{"$f":"IF(I401:N401=\"\",\"\",IF(J401:N401=\"\",I401,IF(K401:N401=\"\",I401&\"・\"&J401,IF(L401:N401=\"\",I401&\"・\"&J401&\"・\"&K401,IF(M401:N401=\"\",I401&\"・\"&J401&\"・\"&K401&\"・\"&L401,IF(N401=\"\",I401&\"・\"&J401&\"・\"&K401&\"・\"&L401&\"・\"&M401,I401&\"・\"&J401&\"・\"&K401&\"・\"&L401&\"・\"&M401&\"・\"&N401))))))","v":""},"","","","",""]
[null,{"$f":"データリスト!Y$46","v":"三六協定"},{"$f":"IF(データリスト!$Y60=\"\",\"\",データリスト!$Y60)","v":""},{"$nulls":17},{"$f":"IF(I402:N402=\"\",\"\",IF(J402:N402=\"\",I402,IF(K402:N402=\"\",I402&\"・\"&J402,IF(L402:N402=\"\",I402&\"・\"&J402&\"・\"&K402,IF(M402:N402=\"\",I402&\"・\"&J402&\"・\"&K402&\"・\"&L402,IF(N402=\"\",I402&\"・\"&J402&\"・\"&K402&\"・\"&L402&\"・\"&M402,I402&\"・\"&J402&\"・\"&K402&\"・\"&L402&\"・\"&M402&\"・\"&N402))))))","v":""},"","","","",""]
[null,{"$f":"データリスト!Y$46","v":"三六協定"},{"$f":"IF(データリスト!$Y61=\"\",\"\",データリスト!$Y61)","v":""},{"$nulls":17},{"$f":"IF(I403:N403=\"\",\"\",IF(J403:N403=\"\",I403,IF(K403:N403=\"\",I403&\"・\"&J403,IF(L403:N403=\"\",I403&\"・\"&J403&\"・\"&K403,IF(M403:N403=\"\",I403&\"・\"&J403&\"・\"&K403&\"・\"&L403,IF(N403=\"\",I403&\"・\"&J403&\"・\"&K403&\"・\"&L403&\"・\"&M403,I403&\"・\"&J403&\"・\"&K403&\"・\"&L403&\"・\"&M403&\"・\"&N403))))))","v":""},"","","","",""]
[null,{"$f":"データリスト!Y$46","v":"三六協定"},{"$f":"IF(データリスト!$Y62=\"\",\"\",データリスト!$Y62)","v":""},{"$nulls":17},{"$f":"IF(I404:N404=\"\",\"\",IF(J404:N404=\"\",I404,IF(K404:N404=\"\",I404&\"・\"&J404,IF(L404:N404=\"\",I404&\"・\"&J404&\"・\"&K404,IF(M404:N404=\"\",I404&\"・\"&J404&\"・\"&K404&\"・\"&L404,IF(N404=\"\",I404&\"・\"&J404&\"・\"&K404&\"・\"&L404&\"・\"&M404,I404&\"・\"&J404&\"・\"&K404&\"・\"&L404&\"・\"&M404&\"・\"&N404))))))","v":""},"","","","",""]
[null,{"$f":"データリスト!Y$46","v":"三六協定"},{"$f":"IF(データリスト!$Y63=\"\",\"\",データリスト!$Y63)","v":""},{"$nulls":17},{"$f":"IF(I405:N405=\"\",\"\",IF(J405:N405=\"\",I405,IF(K405:N405=\"\",I405&\"・\"&J405,IF(L405:N405=\"\",I405&\"・\"&J405&\"・\"&K405,IF(M405:N405=\"\",I405&\"・\"&J405&\"・\"&K405&\"・\"&L405,IF(N405=\"\",I405&\"・\"&J405&\"・\"&K405&\"・\"&L405&\"・\"&M405,I405&\"・\"&J405&\"・\"&K405&\"・\"&L405&\"・\"&M405&\"・\"&N405))))))","v":""},"","","","",""]
[null,{"$f":"データリスト!Y$46","v":"三六協定"},{"$f":"IF(データリスト!$Y64=\"\",\"\",データリスト!$Y64)","v":""},{"$nulls":17},{"$f":"IF(I406:N406=\"\",\"\",IF(J406:N406=\"\",I406,IF(K406:N406=\"\",I406&\"・\"&J406,IF(L406:N406=\"\",I406&\"・\"&J406&\"・\"&K406,IF(M406:N406=\"\",I406&\"・\"&J406&\"・\"&K406&\"・\"&L406,IF(N406=\"\",I406&\"・\"&J406&\"・\"&K406&\"・\"&L406&\"・\"&M406,I406&\"・\"&J406&\"・\"&K406&\"・\"&L406&\"・\"&M406&\"・\"&N406))))))","v":""},"","","","",""]
[null,{"$f":"データリスト!Y$46","v":"三六協定"},{"$f":"IF(データリスト!$Y65=\"\",\"\",データリスト!$Y65)","v":""},{"$nulls":17},{"$f":"IF(I407:N407=\"\",\"\",IF(J407:N407=\"\",I407,IF(K407:N407=\"\",I407&\"・\"&J407,IF(L407:N407=\"\",I407&\"・\"&J407&\"・\"&K407,IF(M407:N407=\"\",I407&\"・\"&J407&\"・\"&K407&\"・\"&L407,IF(N407=\"\",I407&\"・\"&J407&\"・\"&K407&\"・\"&L407&\"・\"&M407,I407&\"・\"&J407&\"・\"&K407&\"・\"&L407&\"・\"&M407&\"・\"&N407))))))","v":""},"","","","",""]
[null,{"$f":"データリスト!Y$46","v":"三六協定"},{"$f":"IF(データリスト!$Y66=\"\",\"\",データリスト!$Y66)","v":""},{"$nulls":17},{"$f":"IF(I408:N408=\"\",\"\",IF(J408:N408=\"\",I408,IF(K408:N408=\"\",I408&\"・\"&J408,IF(L408:N408=\"\",I408&\"・\"&J408&\"・\"&K408,IF(M408:N408=\"\",I408&\"・\"&J408&\"・\"&K408&\"・\"&L408,IF(N408=\"\",I408&\"・\"&J408&\"・\"&K408&\"・\"&L408&\"・\"&M408,I408&\"・\"&J408&\"・\"&K408&\"・\"&L408&\"・\"&M408&\"・\"&N408))))))","v":""},"","","","",""]
[null,{"$f":"データリスト!Z$46","v":"安全推進月間"},{"$f":"IF(データリスト!$Z47=\"\",\"\",データリスト!$Z47)","v":"《準備月間(6月・11月)》"},{"$nulls":17},{"$f":"IF(I409:N409=\"\",\"\",IF(J409:N409=\"\",I409,IF(K409:N409=\"\",I409&\"・\"&J409,IF(L409:N409=\"\",I409&\"・\"&J409&\"・\"&K409,IF(M409:N409=\"\",I409&\"・\"&J409&\"・\"&K409&\"・\"&L409,IF(N409=\"\",I409&\"・\"&J409&\"・\"&K409&\"・\"&L409&\"・\"&M409,I409&\"・\"&J409&\"・\"&K409&\"・\"&L409&\"・\"&M409&\"・\"&N409))))))","v":""},"","","","",""]
[null,{"$f":"データリスト!Z$46","v":"安全推進月間"},{"$f":"IF(データリスト!$Z48=\"\",\"\",データリスト!$Z48)","v":"取組事項の協議"},{"$nulls":17},{"$f":"IF(I410:N410=\"\",\"\",IF(J410:N410=\"\",I410,IF(K410:N410=\"\",I410&\"・\"&J410,IF(L410:N410=\"\",I410&\"・\"&J410&\"・\"&K410,IF(M410:N410=\"\",I410&\"・\"&J410&\"・\"&K410&\"・\"&L410,IF(N410=\"\",I410&\"・\"&J410&\"・\"&K410&\"・\"&L410&\"・\"&M410,I410&\"・\"&J410&\"・\"&K410&\"・\"&L410&\"・\"&M410&\"・\"&N410))))))","v":""},"","","","",""]
[null,{"$f":"データリスト!Z$46","v":"安全推進月間"},{"$f":"IF(データリスト!$Z49=\"\",\"\",データリスト!$Z49)","v":"取組事項の周知"},{"$nulls":17},{"$f":"IF(I411:N411=\"\",\"\",IF(J411:N411=\"\",I411,IF(K411:N411=\"\",I411&\"・\"&J411,IF(L411:N411=\"\",I411&\"・\"&J411&\"・\"&K411,IF(M411:N411=\"\",I411&\"・\"&J411&\"・\"&K411&\"・\"&L411,IF(N411=\"\",I411&\"・\"&J411&\"・\"&K411&\"・\"&L411&\"・\"&M411,I411&\"・\"&J411&\"・\"&K411&\"・\"&L411&\"・\"&M411&\"・\"&N411))))))","v":""},"","","","",""]
[null,{"$f":"データリスト!Z$46","v":"安全推進月間"},{"$f":"IF(データリスト!$Z50=\"\",\"\",データリスト!$Z50)","v":"労使パトロールの日程調整"},{"$nulls":17},{"$f":"IF(I412:N412=\"\",\"\",IF(J412:N412=\"\",I412,IF(K412:N412=\"\",I412&\"・\"&J412,IF(L412:N412=\"\",I412&\"・\"&J412&\"・\"&K412,IF(M412:N412=\"\",I412&\"・\"&J412&\"・\"&K412&\"・\"&L412,IF(N412=\"\",I412&\"・\"&J412&\"・\"&K412&\"・\"&L412&\"・\"&M412,I412&\"・\"&J412&\"・\"&K412&\"・\"&L412&\"・\"&M412&\"・\"&N412))))))","v":""},"","","","",""]
[null,{"$f":"データリスト!Z$46","v":"安全推進月間"},{"$f":"IF(データリスト!$Z51=\"\",\"\",データリスト!$Z51)","v":"安全点検・衛生対話の日程調整"},{"$nulls":17},{"$f":"IF(I413:N413=\"\",\"\",IF(J413:N413=\"\",I413,IF(K413:N413=\"\",I413&\"・\"&J413,IF(L413:N413=\"\",I413&\"・\"&J413&\"・\"&K413,IF(M413:N413=\"\",I413&\"・\"&J413&\"・\"&K413&\"・\"&L413,IF(N413=\"\",I413&\"・\"&J413&\"・\"&K413&\"・\"&L413&\"・\"&M413,I413&\"・\"&J413&\"・\"&K413&\"・\"&L413&\"・\"&M413&\"・\"&N413))))))","v":""},"","","","",""]
[null,{"$f":"データリスト!Z$46","v":"安全推進月間"},{"$f":"IF(データリスト!$Z52=\"\",\"\",データリスト!$Z52)","v":"《本月間(7月・12月)》"},{"$nulls":17},{"$f":"IF(I414:N414=\"\",\"\",IF(J414:N414=\"\",I414,IF(K414:N414=\"\",I414&\"・\"&J414,IF(L414:N414=\"\",I414&\"・\"&J414&\"・\"&K414,IF(M414:N414=\"\",I414&\"・\"&J414&\"・\"&K414&\"・\"&L414,IF(N414=\"\",I414&\"・\"&J414&\"・\"&K414&\"・\"&L414&\"・\"&M414,I414&\"・\"&J414&\"・\"&K414&\"・\"&L414&\"・\"&M414&\"・\"&N414))))))","v":""},"","","","",""]
[null,{"$f":"データリスト!Z$46","v":"安全推進月間"},{"$f":"IF(データリスト!$Z53=\"\",\"\",データリスト!$Z53)","v":"本部委員長メッセージ代読"},{"$nulls":17},{"$f":"IF(I415:N415=\"\",\"\",IF(J415:N415=\"\",I415,IF(K415:N415=\"\",I415&\"・\"&J415,IF(L415:N415=\"\",I415&\"・\"&J415&\"・\"&K415,IF(M415:N415=\"\",I415&\"・\"&J415&\"・\"&K415&\"・\"&L415,IF(N415=\"\",I415&\"・\"&J415&\"・\"&K415&\"・\"&L415&\"・\"&M415,I415&\"・\"&J415&\"・\"&K415&\"・\"&L415&\"・\"&M415&\"・\"&N415))))))","v":""},"","","","",""]
[null,{"$f":"データリスト!Z$46","v":"安全推進月間"},{"$f":"IF(データリスト!$Z54=\"\",\"\",データリスト!$Z54)","v":"「私たちの取組み」の掲示"},{"$nulls":17},{"$f":"IF(I416:N416=\"\",\"\",IF(J416:N416=\"\",I416,IF(K416:N416=\"\",I416&\"・\"&J416,IF(L416:N416=\"\",I416&\"・\"&J416&\"・\"&K416,IF(M416:N416=\"\",I416&\"・\"&J416&\"・\"&K416&\"・\"&L416,IF(N416=\"\",I416&\"・\"&J416&\"・\"&K416&\"・\"&L416&\"・\"&M416,I416&\"・\"&J416&\"・\"&K416&\"・\"&L416&\"・\"&M416&\"・\"&N416))))))","v":""},"","","","",""]
[null,{"$f":"データリスト!Z$46","v":"安全推進月間"},{"$f":"IF(データリスト!$Z55=\"\",\"\",データリスト!$Z55)","v":"☆事業所取り組み事項"},{"$nulls":17},{"$f":"IF(I417:N417=\"\",\"\",IF(J417:N417=\"\",I417,IF(K417:N417=\"\",I417&\"・\"&J417,IF(L417:N417=\"\",I417&\"・\"&J417&\"・\"&K417,IF(M417:N417=\"\",I417&\"・\"&J417&\"・\"&K417&\"・\"&L417,IF(N417=\"\",I417&\"・\"&J417&\"・\"&K417&\"・\"&L417&\"・\"&M417,I417&\"・\"&J417&\"・\"&K417&\"・\"&L417&\"・\"&M417&\"・\"&N417))))))","v":""},"","","","",""]
[null,{"$f":"データリスト!Z$46","v":"安全推進月間"},{"$f":"IF(データリスト!$Z56=\"\",\"\",データリスト!$Z56)","v":"労使パトロール実施"},{"$nulls":17},{"$f":"IF(I418:N418=\"\",\"\",IF(J418:N418=\"\",I418,IF(K418:N418=\"\",I418&\"・\"&J418,IF(L418:N418=\"\",I418&\"・\"&J418&\"・\"&K418,IF(M418:N418=\"\",I418&\"・\"&J418&\"・\"&K418&\"・\"&L418,IF(N418=\"\",I418&\"・\"&J418&\"・\"&K418&\"・\"&L418&\"・\"&M418,I418&\"・\"&J418&\"・\"&K418&\"・\"&L418&\"・\"&M418&\"・\"&N418))))))","v":""},"","","","",""]
[null,{"$f":"データリスト!Z$46","v":"安全推進月間"},{"$f":"IF(データリスト!$Z57=\"\",\"\",データリスト!$Z57)","v":"安全点検・衛生対話実施"},{"$nulls":17},{"$f":"IF(I419:N419=\"\",\"\",IF(J419:N419=\"\",I419,IF(K419:N419=\"\",I419&\"・\"&J419,IF(L419:N419=\"\",I419&\"・\"&J419&\"・\"&K419,IF(M419:N419=\"\",I419&\"・\"&J419&\"・\"&K419&\"・\"&L419,IF(N419=\"\",I419&\"・\"&J419&\"・\"&K419&\"・\"&L419&\"・\"&M419,I419&\"・\"&J419&\"・\"&K419&\"・\"&L419&\"・\"&M419&\"・\"&N419))))))","v":""},"","","","",""]
[null,{"$f":"データリスト!Z$46","v":"安全推進月間"},{"$f":"IF(データリスト!$Z58=\"\",\"\",データリスト!$Z58)","v":""},{"$nulls":17},{"$f":"IF(I420:N420=\"\",\"\",IF(J420:N420=\"\",I420,IF(K420:N420=\"\",I420&\"・\"&J420,IF(L420:N420=\"\",I420&\"・\"&J420&\"・\"&K420,IF(M420:N420=\"\",I420&\"・\"&J420&\"・\"&K420&\"・\"&L420,IF(N420=\"\",I420&\"・\"&J420&\"・\"&K420&\"・\"&L420&\"・\"&M420,I420&\"・\"&J420&\"・\"&K420&\"・\"&L420&\"・\"&M420&\"・\"&N420))))))","v":""},"","","","",""]
[null,{"$f":"データリスト!Z$46","v":"安全推進月間"},{"$f":"IF(データリスト!$Z59=\"\",\"\",データリスト!$Z59)","v":""},{"$nulls":17},{"$f":"IF(I421:N421=\"\",\"\",IF(J421:N421=\"\",I421,IF(K421:N421=\"\",I421&\"・\"&J421,IF(L421:N421=\"\",I421&\"・\"&J421&\"・\"&K421,IF(M421:N421=\"\",I421&\"・\"&J421&\"・\"&K421&\"・\"&L421,IF(N421=\"\",I421&\"・\"&J421&\"・\"&K421&\"・\"&L421&\"・\"&M421,I421&\"・\"&J421&\"・\"&K421&\"・\"&L421&\"・\"&M421&\"・\"&N421))))))","v":""},"","","","",""]
[null,{"$f":"データリスト!Z$46","v":"安全推進月間"},{"$f":"IF(データリスト!$Z60=\"\",\"\",データリスト!$Z60)","v":""},{"$nulls":17},{"$f":"IF(I422:N422=\"\",\"\",IF(J422:N422=\"\",I422,IF(K422:N422=\"\",I422&\"・\"&J422,IF(L422:N422=\"\",I422&\"・\"&J422&\"・\"&K422,IF(M422:N422=\"\",I422&\"・\"&J422&\"・\"&K422&\"・\"&L422,IF(N422=\"\",I422&\"・\"&J422&\"・\"&K422&\"・\"&L422&\"・\"&M422,I422&\"・\"&J422&\"・\"&K422&\"・\"&L422&\"・\"&M422&\"・\"&N422))))))","v":""},"","","","",""]
[null,{"$f":"データリスト!Z$46","v":"安全推進月間"},{"$f":"IF(データリスト!$Z61=\"\",\"\",データリスト!$Z61)","v":""},{"$nulls":17},{"$f":"IF(I423:N423=\"\",\"\",IF(J423:N423=\"\",I423,IF(K423:N423=\"\",I423&\"・\"&J423,IF(L423:N423=\"\",I423&\"・\"&J423&\"・\"&K423,IF(M423:N423=\"\",I423&\"・\"&J423&\"・\"&K423&\"・\"&L423,IF(N423=\"\",I423&\"・\"&J423&\"・\"&K423&\"・\"&L423&\"・\"&M423,I423&\"・\"&J423&\"・\"&K423&\"・\"&L423&\"・\"&M423&\"・\"&N423))))))","v":""},"","","","",""]
[null,{"$f":"データリスト!Z$46","v":"安全推進月間"},{"$f":"IF(データリスト!$Z62=\"\",\"\",データリスト!$Z62)","v":""},{"$nulls":17},{"$f":"IF(I424:N424=\"\",\"\",IF(J424:N424=\"\",I424,IF(K424:N424=\"\",I424&\"・\"&J424,IF(L424:N424=\"\",I424&\"・\"&J424&\"・\"&K424,IF(M424:N424=\"\",I424&\"・\"&J424&\"・\"&K424&\"・\"&L424,IF(N424=\"\",I424&\"・\"&J424&\"・\"&K424&\"・\"&L424&\"・\"&M424,I424&\"・\"&J424&\"・\"&K424&\"・\"&L424&\"・\"&M424&\"・\"&N424))))))","v":""},"","","","",""]
[null,{"$f":"データリスト!Z$46","v":"安全推進月間"},{"$f":"IF(データリスト!$Z63=\"\",\"\",データリスト!$Z63)","v":""},{"$nulls":17},{"$f":"IF(I425:N425=\"\",\"\",IF(J425:N425=\"\",I425,IF(K425:N425=\"\",I425&\"・\"&J425,IF(L425:N425=\"\",I425&\"・\"&J425&\"・\"&K425,IF(M425:N425=\"\",I425&\"・\"&J425&\"・\"&K425&\"・\"&L425,IF(N425=\"\",I425&\"・\"&J425&\"・\"&K425&\"・\"&L425&\"・\"&M425,I425&\"・\"&J425&\"・\"&K425&\"・\"&L425&\"・\"&M425&\"・\"&N425))))))","v":""},"","","","",""]
[null,{"$f":"データリスト!Z$46","v":"安全推進月間"},{"$f":"IF(データリスト!$Z64=\"\",\"\",データリスト!$Z64)","v":""},{"$nulls":17},{"$f":"IF(I426:N426=\"\",\"\",IF(J426:N426=\"\",I426,IF(K426:N426=\"\",I426&\"・\"&J426,IF(L426:N426=\"\",I426&\"・\"&J426&\"・\"&K426,IF(M426:N426=\"\",I426&\"・\"&J426&\"・\"&K426&\"・\"&L426,IF(N426=\"\",I426&\"・\"&J426&\"・\"&K426&\"・\"&L426&\"・\"&M426,I426&\"・\"&J426&\"・\"&K426&\"・\"&L426&\"・\"&M426&\"・\"&N426))))))","v":""},"","","","",""]
[null,{"$f":"データリスト!Z$46","v":"安全推進月間"},{"$f":"IF(データリスト!$Z65=\"\",\"\",データリスト!$Z65)","v":""},{"$nulls":17},{"$f":"IF(I427:N427=\"\",\"\",IF(J427:N427=\"\",I427,IF(K427:N427=\"\",I427&\"・\"&J427,IF(L427:N427=\"\",I427&\"・\"&J427&\"・\"&K427,IF(M427:N427=\"\",I427&\"・\"&J427&\"・\"&K427&\"・\"&L427,IF(N427=\"\",I427&\"・\"&J427&\"・\"&K427&\"・\"&L427&\"・\"&M427,I427&\"・\"&J427&\"・\"&K427&\"・\"&L427&\"・\"&M427&\"・\"&N427))))))","v":""},"","","","",""]
[null,{"$f":"データリスト!Z$46","v":"安全推進月間"},{"$f":"IF(データリスト!$Z66=\"\",\"\",データリスト!$Z66)","v":""},{"$nulls":17},{"$f":"IF(I428:N428=\"\",\"\",IF(J428:N428=\"\",I428,IF(K428:N428=\"\",I428&\"・\"&J428,IF(L428:N428=\"\",I428&\"・\"&J428&\"・\"&K428,IF(M428:N428=\"\",I428&\"・\"&J428&\"・\"&K428&\"・\"&L428,IF(N428=\"\",I428&\"・\"&J428&\"・\"&K428&\"・\"&L428&\"・\"&M428,I428&\"・\"&J428&\"・\"&K428&\"・\"&L428&\"・\"&M428&\"・\"&N428))))))","v":""},"","","","",""]
[null,{"$f":"データリスト!AA$46","v":"ユニオンスクール"},{"$f":"IF(データリスト!$AA47=\"\",\"\",データリスト!$AA47)","v":"フレッシュコース(新入社員)"},{"$nulls":17},{"$f":"IF(I429:N429=\"\",\"\",IF(J429:N429=\"\",I429,IF(K429:N429=\"\",I429&\"・\"&J429,IF(L429:N429=\"\",I429&\"・\"&J429&\"・\"&K429,IF(M429:N429=\"\",I429&\"・\"&J429&\"・\"&K429&\"・\"&L429,IF(N429=\"\",I429&\"・\"&J429&\"・\"&K429&\"・\"&L429&\"・\"&M429,I429&\"・\"&J429&\"・\"&K429&\"・\"&L429&\"・\"&M429&\"・\"&N429))))))","v":""},"","","","",""]
[null,{"$f":"データリスト!AA$46","v":"ユニオンスクール"},{"$f":"IF(データリスト!$AA48=\"\",\"\",データリスト!$AA48)","v":"ヤングコース(3年目)"},{"$nulls":17},{"$f":"IF(I430:N430=\"\",\"\",IF(J430:N430=\"\",I430,IF(K430:N430=\"\",I430&\"・\"&J430,IF(L430:N430=\"\",I430&\"・\"&J430&\"・\"&K430,IF(M430:N430=\"\",I430&\"・\"&J430&\"・\"&K430&\"・\"&L430,IF(N430=\"\",I430&\"・\"&J430&\"・\"&K430&\"・\"&L430&\"・\"&M430,I430&\"・\"&J430&\"・\"&K430&\"・\"&L430&\"・\"&M430&\"・\"&N430))))))","v":""},"","","","",""]
[null,{"$f":"データリスト!AA$46","v":"ユニオンスクール"},{"$f":"IF(データリスト!$AA49=\"\",\"\",データリスト!$AA49)","v":"パワーアップコース(7年目)"},{"$nulls":17},{"$f":"IF(I431:N431=\"\",\"\",IF(J431:N431=\"\",I431,IF(K431:N431=\"\",I431&\"・\"&J431,IF(L431:N431=\"\",I431&\"・\"&J431&\"・\"&K431,IF(M431:N431=\"\",I431&\"・\"&J431&\"・\"&K431&\"・\"&L431,IF(N431=\"\",I431&\"・\"&J431&\"・\"&K431&\"・\"&L431&\"・\"&M431,I431&\"・\"&J431&\"・\"&K431&\"・\"&L431&\"・\"&M431&\"・\"&N431))))))","v":""},"","","","",""]
[null,{"$f":"データリスト!AA$46","v":"ユニオンスクール"},{"$f":"IF(データリスト!$AA50=\"\",\"\",データリスト!$AA50)","v":"ステップアップコース(10年目)"},{"$nulls":17},{"$f":"IF(I432:N432=\"\",\"\",IF(J432:N432=\"\",I432,IF(K432:N432=\"\",I432&\"・\"&J432,IF(L432:N432=\"\",I432&\"・\"&J432&\"・\"&K432,IF(M432:N432=\"\",I432&\"・\"&J432&\"・\"&K432&\"・\"&L432,IF(N432=\"\",I432&\"・\"&J432&\"・\"&K432&\"・\"&L432&\"・\"&M432,I432&\"・\"&J432&\"・\"&K432&\"・\"&L432&\"・\"&M432&\"・\"&N432))))))","v":""},"","","","",""]
[null,{"$f":"データリスト!AA$46","v":"ユニオンスクール"},{"$f":"IF(データリスト!$AA51=\"\",\"\",データリスト!$AA51)","v":"フォローアップコース(15年目以降の対象者)"},{"$nulls":17},{"$f":"IF(I433:N433=\"\",\"\",IF(J433:N433=\"\",I433,IF(K433:N433=\"\",I433&\"・\"&J433,IF(L433:N433=\"\",I433&\"・\"&J433&\"・\"&K433,IF(M433:N433=\"\",I433&\"・\"&J433&\"・\"&K433&\"・\"&L433,IF(N433=\"\",I433&\"・\"&J433&\"・\"&K433&\"・\"&L433&\"・\"&M433,I433&\"・\"&J433&\"・\"&K433&\"・\"&L433&\"・\"&M433&\"・\"&N433))))))","v":""},"","","","",""]
[null,{"$f":"データリスト!AA$46","v":"ユニオンスクール"},{"$f":"IF(データリスト!$AA52=\"\",\"\",データリスト!$AA52)","v":""},{"$nulls":17},{"$f":"IF(I434:N434=\"\",\"\",IF(J434:N434=\"\",I434,IF(K434:N434=\"\",I434&\"・\"&J434,IF(L434:N434=\"\",I434&\"・\"&J434&\"・\"&K434,IF(M434:N434=\"\",I434&\"・\"&J434&\"・\"&K434&\"・\"&L434,IF(N434=\"\",I434&\"・\"&J434&\"・\"&K434&\"・\"&L434&\"・\"&M434,I434&\"・\"&J434&\"・\"&K434&\"・\"&L434&\"・\"&M434&\"・\"&N434))))))","v":""},"","","","",""]
[null,{"$f":"データリスト!AA$46","v":"ユニオンスクール"},{"$f":"IF(データリスト!$AA53=\"\",\"\",データリスト!$AA53)","v":""},{"$nulls":17},{"$f":"IF(I435:N435=\"\",\"\",IF(J435:N435=\"\",I435,IF(K435:N435=\"\",I435&\"・\"&J435,IF(L435:N435=\"\",I435&\"・\"&J435&\"・\"&K435,IF(M435:N435=\"\",I435&\"・\"&J435&\"・\"&K435&\"・\"&L435,IF(N435=\"\",I435&\"・\"&J435&\"・\"&K435&\"・\"&L435&\"・\"&M435,I435&\"・\"&J435&\"・\"&K435&\"・\"&L435&\"・\"&M435&\"・\"&N435))))))","v":""},"","","","",""]
[null,{"$f":"データリスト!AA$46","v":"ユニオンスクール"},{"$f":"IF(データリスト!$AA54=\"\",\"\",データリスト!$AA54)","v":""},{"$nulls":17},{"$f":"IF(I436:N436=\"\",\"\",IF(J436:N436=\"\",I436,IF(K436:N436=\"\",I436&\"・\"&J436,IF(L436:N436=\"\",I436&\"・\"&J436&\"・\"&K436,IF(M436:N436=\"\",I436&\"・\"&J436&\"・\"&K436&\"・\"&L436,IF(N436=\"\",I436&\"・\"&J436&\"・\"&K436&\"・\"&L436&\"・\"&M436,I436&\"・\"&J436&\"・\"&K436&\"・\"&L436&\"・\"&M436&\"・\"&N436))))))","v":""},"","","","",""]
[null,{"$f":"データリスト!AA$46","v":"ユニオンスクール"},{"$f":"IF(データリスト!$AA55=\"\",\"\",データリスト!$AA55)","v":""},{"$nulls":17},{"$f":"IF(I437:N437=\"\",\"\",IF(J437:N437=\"\",I437,IF(K437:N437=\"\",I437&\"・\"&J437,IF(L437:N437=\"\",I437&\"・\"&J437&\"・\"&K437,IF(M437:N437=\"\",I437&\"・\"&J437&\"・\"&K437&\"・\"&L437,IF(N437=\"\",I437&\"・\"&J437&\"・\"&K437&\"・\"&L437&\"・\"&M437,I437&\"・\"&J437&\"・\"&K437&\"・\"&L437&\"・\"&M437&\"・\"&N437))))))","v":""},"","","","",""]
[null,{"$f":"データリスト!AA$46","v":"ユニオンスクール"},{"$f":"IF(データリスト!$AA56=\"\",\"\",データリスト!$AA56)","v":""},{"$nulls":17},{"$f":"IF(I438:N438=\"\",\"\",IF(J438:N438=\"\",I438,IF(K438:N438=\"\",I438&\"・\"&J438,IF(L438:N438=\"\",I438&\"・\"&J438&\"・\"&K438,IF(M438:N438=\"\",I438&\"・\"&J438&\"・\"&K438&\"・\"&L438,IF(N438=\"\",I438&\"・\"&J438&\"・\"&K438&\"・\"&L438&\"・\"&M438,I438&\"・\"&J438&\"・\"&K438&\"・\"&L438&\"・\"&M438&\"・\"&N438))))))","v":""},"","","","",""]
[null,{"$f":"データリスト!AA$46","v":"ユニオンスクール"},{"$f":"IF(データリスト!$AA57=\"\",\"\",データリスト!$AA57)","v":""},{"$nulls":17},{"$f":"IF(I439:N439=\"\",\"\",IF(J439:N439=\"\",I439,IF(K439:N439=\"\",I439&\"・\"&J439,IF(L439:N439=\"\",I439&\"・\"&J439&\"・\"&K439,IF(M439:N439=\"\",I439&\"・\"&J439&\"・\"&K439&\"・\"&L439,IF(N439=\"\",I439&\"・\"&J439&\"・\"&K439&\"・\"&L439&\"・\"&M439,I439&\"・\"&J439&\"・\"&K439&\"・\"&L439&\"・\"&M439&\"・\"&N439))))))","v":""},"","","","",""]
[null,{"$f":"データリスト!AA$46","v":"ユニオンスクール"},{"$f":"IF(データリスト!$AA58=\"\",\"\",データリスト!$AA58)","v":""},{"$nulls":17},{"$f":"IF(I440:N440=\"\",\"\",IF(J440:N440=\"\",I440,IF(K440:N440=\"\",I440&\"・\"&J440,IF(L440:N440=\"\",I440&\"・\"&J440&\"・\"&K440,IF(M440:N440=\"\",I440&\"・\"&J440&\"・\"&K440&\"・\"&L440,IF(N440=\"\",I440&\"・\"&J440&\"・\"&K440&\"・\"&L440&\"・\"&M440,I440&\"・\"&J440&\"・\"&K440&\"・\"&L440&\"・\"&M440&\"・\"&N440))))))","v":""},"","","","",""]
[null,{"$f":"データリスト!AA$46","v":"ユニオンスクール"},{"$f":"IF(データリスト!$AA59=\"\",\"\",データリスト!$AA59)","v":""},{"$nulls":17},{"$f":"IF(I441:N441=\"\",\"\",IF(J441:N441=\"\",I441,IF(K441:N441=\"\",I441&\"・\"&J441,IF(L441:N441=\"\",I441&\"・\"&J441&\"・\"&K441,IF(M441:N441=\"\",I441&\"・\"&J441&\"・\"&K441&\"・\"&L441,IF(N441=\"\",I441&\"・\"&J441&\"・\"&K441&\"・\"&L441&\"・\"&M441,I441&\"・\"&J441&\"・\"&K441&\"・\"&L441&\"・\"&M441&\"・\"&N441))))))","v":""},"","","","",""]
[null,{"$f":"データリスト!AA$46","v":"ユニオンスクール"},{"$f":"IF(データリスト!$AA60=\"\",\"\",データリスト!$AA60)","v":""},{"$nulls":17},{"$f":"IF(I442:N442=\"\",\"\",IF(J442:N442=\"\",I442,IF(K442:N442=\"\",I442&\"・\"&J442,IF(L442:N442=\"\",I442&\"・\"&J442&\"・\"&K442,IF(M442:N442=\"\",I442&\"・\"&J442&\"・\"&K442&\"・\"&L442,IF(N442=\"\",I442&\"・\"&J442&\"・\"&K442&\"・\"&L442&\"・\"&M442,I442&\"・\"&J442&\"・\"&K442&\"・\"&L442&\"・\"&M442&\"・\"&N442))))))","v":""},"","","","",""]
[null,{"$f":"データリスト!AA$46","v":"ユニオンスクール"},{"$f":"IF(データリスト!$AA61=\"\",\"\",データリスト!$AA61)","v":""},{"$nulls":17},{"$f":"IF(I443:N443=\"\",\"\",IF(J443:N443=\"\",I443,IF(K443:N443=\"\",I443&\"・\"&J443,IF(L443:N443=\"\",I443&\"・\"&J443&\"・\"&K443,IF(M443:N443=\"\",I443&\"・\"&J443&\"・\"&K443&\"・\"&L443,IF(N443=\"\",I443&\"・\"&J443&\"・\"&K443&\"・\"&L443&\"・\"&M443,I443&\"・\"&J443&\"・\"&K443&\"・\"&L443&\"・\"&M443&\"・\"&N443))))))","v":""},"","","","",""]
[null,{"$f":"データリスト!AA$46","v":"ユニオンスクール"},{"$f":"IF(データリスト!$AA62=\"\",\"\",データリスト!$AA62)","v":""},{"$nulls":17},{"$f":"IF(I444:N444=\"\",\"\",IF(J444:N444=\"\",I444,IF(K444:N444=\"\",I444&\"・\"&J444,IF(L444:N444=\"\",I444&\"・\"&J444&\"・\"&K444,IF(M444:N444=\"\",I444&\"・\"&J444&\"・\"&K444&\"・\"&L444,IF(N444=\"\",I444&\"・\"&J444&\"・\"&K444&\"・\"&L444&\"・\"&M444,I444&\"・\"&J444&\"・\"&K444&\"・\"&L444&\"・\"&M444&\"・\"&N444))))))","v":""},"","","","",""]
[null,{"$f":"データリスト!AA$46","v":"ユニオンスクール"},{"$f":"IF(データリスト!$AA63=\"\",\"\",データリスト!$AA63)","v":""},{"$nulls":17},{"$f":"IF(I445:N445=\"\",\"\",IF(J445:N445=\"\",I445,IF(K445:N445=\"\",I445&\"・\"&J445,IF(L445:N445=\"\",I445&\"・\"&J445&\"・\"&K445,IF(M445:N445=\"\",I445&\"・\"&J445&\"・\"&K445&\"・\"&L445,IF(N445=\"\",I445&\"・\"&J445&\"・\"&K445&\"・\"&L445&\"・\"&M445,I445&\"・\"&J445&\"・\"&K445&\"・\"&L445&\"・\"&M445&\"・\"&N445))))))","v":""},"","","","",""]
[null,{"$f":"データリスト!AA$46","v":"ユニオンスクール"},{"$f":"IF(データリスト!$AA64=\"\",\"\",データリスト!$AA64)","v":""},{"$nulls":17},{"$f":"IF(I446:N446=\"\",\"\",IF(J446:N446=\"\",I446,IF(K446:N446=\"\",I446&\"・\"&J446,IF(L446:N446=\"\",I446&\"・\"&J446&\"・\"&K446,IF(M446:N446=\"\",I446&\"・\"&J446&\"・\"&K446&\"・\"&L446,IF(N446=\"\",I446&\"・\"&J446&\"・\"&K446&\"・\"&L446&\"・\"&M446,I446&\"・\"&J446&\"・\"&K446&\"・\"&L446&\"・\"&M446&\"・\"&N446))))))","v":""},"","","","",""]
[null,{"$f":"データリスト!AA$46","v":"ユニオンスクール"},{"$f":"IF(データリスト!$AA65=\"\",\"\",データリスト!$AA65)","v":""},{"$nulls":17},{"$f":"IF(I447:N447=\"\",\"\",IF(J447:N447=\"\",I447,IF(K447:N447=\"\",I447&\"・\"&J447,IF(L447:N447=\"\",I447&\"・\"&J447&\"・\"&K447,IF(M447:N447=\"\",I447&\"・\"&J447&\"・\"&K447&\"・\"&L447,IF(N447=\"\",I447&\"・\"&J447&\"・\"&K447&\"・\"&L447&\"・\"&M447,I447&\"・\"&J447&\"・\"&K447&\"・\"&L447&\"・\"&M447&\"・\"&N447))))))","v":""},"","","","",""]
[null,{"$f":"データリスト!AA$46","v":"ユニオンスクール"},{"$f":"IF(データリスト!$AA66=\"\",\"\",データリスト!$AA66)","v":""},{"$nulls":17},{"$f":"IF(I448:N448=\"\",\"\",IF(J448:N448=\"\",I448,IF(K448:N448=\"\",I448&\"・\"&J448,IF(L448:N448=\"\",I448&\"・\"&J448&\"・\"&K448,IF(M448:N448=\"\",I448&\"・\"&J448&\"・\"&K448&\"・\"&L448,IF(N448=\"\",I448&\"・\"&J448&\"・\"&K448&\"・\"&L448&\"・\"&M448,I448&\"・\"&J448&\"・\"&K448&\"・\"&L448&\"・\"&M448&\"・\"&N448))))))","v":""},"","","","",""]
[null,{"$f":"データリスト!AB$46","v":"リーダーカレッジ"},{"$f":"IF(データリスト!$AB47=\"\",\"\",データリスト!$AB47)","v":"青年リーダー研修"},{"$nulls":17},{"$f":"IF(I449:N449=\"\",\"\",IF(J449:N449=\"\",I449,IF(K449:N449=\"\",I449&\"・\"&J449,IF(L449:N449=\"\",I449&\"・\"&J449&\"・\"&K449,IF(M449:N449=\"\",I449&\"・\"&J449&\"・\"&K449&\"・\"&L449,IF(N449=\"\",I449&\"・\"&J449&\"・\"&K449&\"・\"&L449&\"・\"&M449,I449&\"・\"&J449&\"・\"&K449&\"・\"&L449&\"・\"&M449&\"・\"&N449))))))","v":""},"","","","",""]
[null,{"$f":"データリスト!AB$46","v":"リーダーカレッジ"},{"$f":"IF(データリスト!$AB48=\"\",\"\",データリスト!$AB48)","v":"レクリーダー研修"},{"$nulls":17},{"$f":"IF(I450:N450=\"\",\"\",IF(J450:N450=\"\",I450,IF(K450:N450=\"\",I450&\"・\"&J450,IF(L450:N450=\"\",I450&\"・\"&J450&\"・\"&K450,IF(M450:N450=\"\",I450&\"・\"&J450&\"・\"&K450&\"・\"&L450,IF(N450=\"\",I450&\"・\"&J450&\"・\"&K450&\"・\"&L450&\"・\"&M450,I450&\"・\"&J450&\"・\"&K450&\"・\"&L450&\"・\"&M450&\"・\"&N450))))))","v":""},"","","","",""]
[null,{"$f":"データリスト!AB$46","v":"リーダーカレッジ"},{"$f":"IF(データリスト!$AB49=\"\",\"\",データリスト!$AB49)","v":"分会役員研修"},{"$nulls":17},{"$f":"IF(I451:N451=\"\",\"\",IF(J451:N451=\"\",I451,IF(K451:N451=\"\",I451&\"・\"&J451,IF(L451:N451=\"\",I451&\"・\"&J451&\"・\"&K451,IF(M451:N451=\"\",I451&\"・\"&J451&\"・\"&K451&\"・\"&L451,IF(N451=\"\",I451&\"・\"&J451&\"・\"&K451&\"・\"&L451&\"・\"&M451,I451&\"・\"&J451&\"・\"&K451&\"・\"&L451&\"・\"&M451&\"・\"&N451))))))","v":""},"","","","",""]
[null,{"$f":"データリスト!AB$46","v":"リーダーカレッジ"},{"$f":"IF(データリスト!$AB50=\"\",\"\",データリスト!$AB50)","v":"分会委員長研修"},{"$nulls":17},{"$f":"IF(I452:N452=\"\",\"\",IF(J452:N452=\"\",I452,IF(K452:N452=\"\",I452&\"・\"&J452,IF(L452:N452=\"\",I452&\"・\"&J452&\"・\"&K452,IF(M452:N452=\"\",I452&\"・\"&J452&\"・\"&K452&\"・\"&L452,IF(N452=\"\",I452&\"・\"&J452&\"・\"&K452&\"・\"&L452&\"・\"&M452,I452&\"・\"&J452&\"・\"&K452&\"・\"&L452&\"・\"&M452&\"・\"&N452))))))","v":""},"","","","",""]
[null,{"$f":"データリスト!AB$46","v":"リーダーカレッジ"},{"$f":"IF(データリスト!$AB51=\"\",\"\",データリスト!$AB51)","v":""},{"$nulls":17},{"$f":"IF(I453:N453=\"\",\"\",IF(J453:N453=\"\",I453,IF(K453:N453=\"\",I453&\"・\"&J453,IF(L453:N453=\"\",I453&\"・\"&J453&\"・\"&K453,IF(M453:N453=\"\",I453&\"・\"&J453&\"・\"&K453&\"・\"&L453,IF(N453=\"\",I453&\"・\"&J453&\"・\"&K453&\"・\"&L453&\"・\"&M453,I453&\"・\"&J453&\"・\"&K453&\"・\"&L453&\"・\"&M453&\"・\"&N453))))))","v":""},"","","","",""]
[null,{"$f":"データリスト!AB$46","v":"リーダーカレッジ"},{"$f":"IF(データリスト!$AB52=\"\",\"\",データリスト!$AB52)","v":""},{"$nulls":17},{"$f":"IF(I454:N454=\"\",\"\",IF(J454:N454=\"\",I454,IF(K454:N454=\"\",I454&\"・\"&J454,IF(L454:N454=\"\",I454&\"・\"&J454&\"・\"&K454,IF(M454:N454=\"\",I454&\"・\"&J454&\"・\"&K454&\"・\"&L454,IF(N454=\"\",I454&\"・\"&J454&\"・\"&K454&\"・\"&L454&\"・\"&M454,I454&\"・\"&J454&\"・\"&K454&\"・\"&L454&\"・\"&M454&\"・\"&N454))))))","v":""},"","","","",""]
[null,{"$f":"データリスト!AB$46","v":"リーダーカレッジ"},{"$f":"IF(データリスト!$AB53=\"\",\"\",データリスト!$AB53)","v":""},{"$nulls":17},{"$f":"IF(I455:N455=\"\",\"\",IF(J455:N455=\"\",I455,IF(K455:N455=\"\",I455&\"・\"&J455,IF(L455:N455=\"\",I455&\"・\"&J455&\"・\"&K455,IF(M455:N455=\"\",I455&\"・\"&J455&\"・\"&K455&\"・\"&L455,IF(N455=\"\",I455&\"・\"&J455&\"・\"&K455&\"・\"&L455&\"・\"&M455,I455&\"・\"&J455&\"・\"&K455&\"・\"&L455&\"・\"&M455&\"・\"&N455))))))","v":""},"","","","",""]
[null,{"$f":"データリスト!AB$46","v":"リーダーカレッジ"},{"$f":"IF(データリスト!$AB54=\"\",\"\",データリスト!$AB54)","v":""},{"$nulls":17},{"$f":"IF(I456:N456=\"\",\"\",IF(J456:N456=\"\",I456,IF(K456:N456=\"\",I456&\"・\"&J456,IF(L456:N456=\"\",I456&\"・\"&J456&\"・\"&K456,IF(M456:N456=\"\",I456&\"・\"&J456&\"・\"&K456&\"・\"&L456,IF(N456=\"\",I456&\"・\"&J456&\"・\"&K456&\"・\"&L456&\"・\"&M456,I456&\"・\"&J456&\"・\"&K456&\"・\"&L456&\"・\"&M456&\"・\"&N456))))))","v":""},"","","","",""]
[null,{"$f":"データリスト!AB$46","v":"リーダーカレッジ"},{"$f":"IF(データリスト!$AB55=\"\",\"\",データリスト!$AB55)","v":""},{"$nulls":17},{"$f":"IF(I457:N457=\"\",\"\",IF(J457:N457=\"\",I457,IF(K457:N457=\"\",I457&\"・\"&J457,IF(L457:N457=\"\",I457&\"・\"&J457&\"・\"&K457,IF(M457:N457=\"\",I457&\"・\"&J457&\"・\"&K457&\"・\"&L457,IF(N457=\"\",I457&\"・\"&J457&\"・\"&K457&\"・\"&L457&\"・\"&M457,I457&\"・\"&J457&\"・\"&K457&\"・\"&L457&\"・\"&M457&\"・\"&N457))))))","v":""},"","","","",""]
[null,{"$f":"データリスト!AB$46","v":"リーダーカレッジ"},{"$f":"IF(データリスト!$AB56=\"\",\"\",データリスト!$AB56)","v":""},{"$nulls":17},{"$f":"IF(I458:N458=\"\",\"\",IF(J458:N458=\"\",I458,IF(K458:N458=\"\",I458&\"・\"&J458,IF(L458:N458=\"\",I458&\"・\"&J458&\"・\"&K458,IF(M458:N458=\"\",I458&\"・\"&J458&\"・\"&K458&\"・\"&L458,IF(N458=\"\",I458&\"・\"&J458&\"・\"&K458&\"・\"&L458&\"・\"&M458,I458&\"・\"&J458&\"・\"&K458&\"・\"&L458&\"・\"&M458&\"・\"&N458))))))","v":""},"","","","",""]
[null,{"$f":"データリスト!AB$46","v":"リーダーカレッジ"},{"$f":"IF(データリスト!$AB57=\"\",\"\",データリスト!$AB57)","v":""},{"$nulls":17},{"$f":"IF(I459:N459=\"\",\"\",IF(J459:N459=\"\",I459,IF(K459:N459=\"\",I459&\"・\"&J459,IF(L459:N459=\"\",I459&\"・\"&J459&\"・\"&K459,IF(M459:N459=\"\",I459&\"・\"&J459&\"・\"&K459&\"・\"&L459,IF(N459=\"\",I459&\"・\"&J459&\"・\"&K459&\"・\"&L459&\"・\"&M459,I459&\"・\"&J459&\"・\"&K459&\"・\"&L459&\"・\"&M459&\"・\"&N459))))))","v":""},"","","","",""]
[null,{"$f":"データリスト!AB$46","v":"リーダーカレッジ"},{"$f":"IF(データリスト!$AB58=\"\",\"\",データリスト!$AB58)","v":""},{"$nulls":17},{"$f":"IF(I460:N460=\"\",\"\",IF(J460:N460=\"\",I460,IF(K460:N460=\"\",I460&\"・\"&J460,IF(L460:N460=\"\",I460&\"・\"&J460&\"・\"&K460,IF(M460:N460=\"\",I460&\"・\"&J460&\"・\"&K460&\"・\"&L460,IF(N460=\"\",I460&\"・\"&J460&\"・\"&K460&\"・\"&L460&\"・\"&M460,I460&\"・\"&J460&\"・\"&K460&\"・\"&L460&\"・\"&M460&\"・\"&N460))))))","v":""},"","","","",""]
[null,{"$f":"データリスト!AB$46","v":"リーダーカレッジ"},{"$f":"IF(データリスト!$AB59=\"\",\"\",データリスト!$AB59)","v":""},{"$nulls":17},{"$f":"IF(I461:N461=\"\",\"\",IF(J461:N461=\"\",I461,IF(K461:N461=\"\",I461&\"・\"&J461,IF(L461:N461=\"\",I461&\"・\"&J461&\"・\"&K461,IF(M461:N461=\"\",I461&\"・\"&J461&\"・\"&K461&\"・\"&L461,IF(N461=\"\",I461&\"・\"&J461&\"・\"&K461&\"・\"&L461&\"・\"&M461,I461&\"・\"&J461&\"・\"&K461&\"・\"&L461&\"・\"&M461&\"・\"&N461))))))","v":""},"","","","",""]
[null,{"$f":"データリスト!AB$46","v":"リーダーカレッジ"},{"$f":"IF(データリスト!$AB60=\"\",\"\",データリスト!$AB60)","v":""},{"$nulls":17},{"$f":"IF(I462:N462=\"\",\"\",IF(J462:N462=\"\",I462,IF(K462:N462=\"\",I462&\"・\"&J462,IF(L462:N462=\"\",I462&\"・\"&J462&\"・\"&K462,IF(M462:N462=\"\",I462&\"・\"&J462&\"・\"&K462&\"・\"&L462,IF(N462=\"\",I462&\"・\"&J462&\"・\"&K462&\"・\"&L462&\"・\"&M462,I462&\"・\"&J462&\"・\"&K462&\"・\"&L462&\"・\"&M462&\"・\"&N462))))))","v":""},"","","","",""]
[null,{"$f":"データリスト!AB$46","v":"リーダーカレッジ"},{"$f":"IF(データリスト!$AB61=\"\",\"\",データリスト!$AB61)","v":""},{"$nulls":17},{"$f":"IF(I463:N463=\"\",\"\",IF(J463:N463=\"\",I463,IF(K463:N463=\"\",I463&\"・\"&J463,IF(L463:N463=\"\",I463&\"・\"&J463&\"・\"&K463,IF(M463:N463=\"\",I463&\"・\"&J463&\"・\"&K463&\"・\"&L463,IF(N463=\"\",I463&\"・\"&J463&\"・\"&K463&\"・\"&L463&\"・\"&M463,I463&\"・\"&J463&\"・\"&K463&\"・\"&L463&\"・\"&M463&\"・\"&N463))))))","v":""},"","","","",""]
[null,{"$f":"データリスト!AB$46","v":"リーダーカレッジ"},{"$f":"IF(データリスト!$AB62=\"\",\"\",データリスト!$AB62)","v":""},{"$nulls":17},{"$f":"IF(I464:N464=\"\",\"\",IF(J464:N464=\"\",I464,IF(K464:N464=\"\",I464&\"・\"&J464,IF(L464:N464=\"\",I464&\"・\"&J464&\"・\"&K464,IF(M464:N464=\"\",I464&\"・\"&J464&\"・\"&K464&\"・\"&L464,IF(N464=\"\",I464&\"・\"&J464&\"・\"&K464&\"・\"&L464&\"・\"&M464,I464&\"・\"&J464&\"・\"&K464&\"・\"&L464&\"・\"&M464&\"・\"&N464))))))","v":""},"","","","",""]
[null,{"$f":"データリスト!AB$46","v":"リーダーカレッジ"},{"$f":"IF(データリスト!$AB63=\"\",\"\",データリスト!$AB63)","v":""},{"$nulls":17},{"$f":"IF(I465:N465=\"\",\"\",IF(J465:N465=\"\",I465,IF(K465:N465=\"\",I465&\"・\"&J465,IF(L465:N465=\"\",I465&\"・\"&J465&\"・\"&K465,IF(M465:N465=\"\",I465&\"・\"&J465&\"・\"&K465&\"・\"&L465,IF(N465=\"\",I465&\"・\"&J465&\"・\"&K465&\"・\"&L465&\"・\"&M465,I465&\"・\"&J465&\"・\"&K465&\"・\"&L465&\"・\"&M465&\"・\"&N465))))))","v":""},"","","","",""]
[null,{"$f":"データリスト!AB$46","v":"リーダーカレッジ"},{"$f":"IF(データリスト!$AB64=\"\",\"\",データリスト!$AB64)","v":""},{"$nulls":17},{"$f":"IF(I466:N466=\"\",\"\",IF(J466:N466=\"\",I466,IF(K466:N466=\"\",I466&\"・\"&J466,IF(L466:N466=\"\",I466&\"・\"&J466&\"・\"&K466,IF(M466:N466=\"\",I466&\"・\"&J466&\"・\"&K466&\"・\"&L466,IF(N466=\"\",I466&\"・\"&J466&\"・\"&K466&\"・\"&L466&\"・\"&M466,I466&\"・\"&J466&\"・\"&K466&\"・\"&L466&\"・\"&M466&\"・\"&N466))))))","v":""},"","","","",""]
[null,{"$f":"データリスト!AB$46","v":"リーダーカレッジ"},{"$f":"IF(データリスト!$AB65=\"\",\"\",データリスト!$AB65)","v":""},{"$nulls":17},{"$f":"IF(I467:N467=\"\",\"\",IF(J467:N467=\"\",I467,IF(K467:N467=\"\",I467&\"・\"&J467,IF(L467:N467=\"\",I467&\"・\"&J467&\"・\"&K467,IF(M467:N467=\"\",I467&\"・\"&J467&\"・\"&K467&\"・\"&L467,IF(N467=\"\",I467&\"・\"&J467&\"・\"&K467&\"・\"&L467&\"・\"&M467,I467&\"・\"&J467&\"・\"&K467&\"・\"&L467&\"・\"&M467&\"・\"&N467))))))","v":""},"","","","",""]
[null,{"$f":"データリスト!AB$46","v":"リーダーカレッジ"},{"$f":"IF(データリスト!$AB66=\"\",\"\",データリスト!$AB66)","v":""},{"$nulls":17},{"$f":"IF(I468:N468=\"\",\"\",IF(J468:N468=\"\",I468,IF(K468:N468=\"\",I468&\"・\"&J468,IF(L468:N468=\"\",I468&\"・\"&J468&\"・\"&K468,IF(M468:N468=\"\",I468&\"・\"&J468&\"・\"&K468&\"・\"&L468,IF(N468=\"\",I468&\"・\"&J468&\"・\"&K468&\"・\"&L468&\"・\"&M468,I468&\"・\"&J468&\"・\"&K468&\"・\"&L468&\"・\"&M468&\"・\"&N468))))))","v":""},"","","","",""]
[null,{"$f":"データリスト!AC$46","v":"ライフプランセミナー"},{"$f":"IF(データリスト!$AC47=\"\",\"\",データリスト!$AC47)","v":"ライフステージコース"},{"$nulls":17},{"$f":"IF(I469:N469=\"\",\"\",IF(J469:N469=\"\",I469,IF(K469:N469=\"\",I469&\"・\"&J469,IF(L469:N469=\"\",I469&\"・\"&J469&\"・\"&K469,IF(M469:N469=\"\",I469&\"・\"&J469&\"・\"&K469&\"・\"&L469,IF(N469=\"\",I469&\"・\"&J469&\"・\"&K469&\"・\"&L469&\"・\"&M469,I469&\"・\"&J469&\"・\"&K469&\"・\"&L469&\"・\"&M469&\"・\"&N469))))))","v":""},"","","","",""]
[null,{"$f":"データリスト!AC$46","v":"ライフプランセミナー"},{"$f":"IF(データリスト!$AC48=\"\",\"\",データリスト!$AC48)","v":"ライフサポートコース"},{"$nulls":17},{"$f":"IF(I470:N470=\"\",\"\",IF(J470:N470=\"\",I470,IF(K470:N470=\"\",I470&\"・\"&J470,IF(L470:N470=\"\",I470&\"・\"&J470&\"・\"&K470,IF(M470:N470=\"\",I470&\"・\"&J470&\"・\"&K470&\"・\"&L470,IF(N470=\"\",I470&\"・\"&J470&\"・\"&K470&\"・\"&L470&\"・\"&M470,I470&\"・\"&J470&\"・\"&K470&\"・\"&L470&\"・\"&M470&\"・\"&N470))))))","v":""},"","","","",""]
[null,{"$f":"データリスト!AC$46","v":"ライフプランセミナー"},{"$f":"IF(データリスト!$AC49=\"\",\"\",データリスト!$AC49)","v":""},{"$nulls":17},{"$f":"IF(I471:N471=\"\",\"\",IF(J471:N471=\"\",I471,IF(K471:N471=\"\",I471&\"・\"&J471,IF(L471:N471=\"\",I471&\"・\"&J471&\"・\"&K471,IF(M471:N471=\"\",I471&\"・\"&J471&\"・\"&K471&\"・\"&L471,IF(N471=\"\",I471&\"・\"&J471&\"・\"&K471&\"・\"&L471&\"・\"&M471,I471&\"・\"&J471&\"・\"&K471&\"・\"&L471&\"・\"&M471&\"・\"&N471))))))","v":""},"","","","",""]
[null,{"$f":"データリスト!AC$46","v":"ライフプランセミナー"},{"$f":"IF(データリスト!$AC50=\"\",\"\",データリスト!$AC50)","v":""},{"$nulls":17},{"$f":"IF(I472:N472=\"\",\"\",IF(J472:N472=\"\",I472,IF(K472:N472=\"\",I472&\"・\"&J472,IF(L472:N472=\"\",I472&\"・\"&J472&\"・\"&K472,IF(M472:N472=\"\",I472&\"・\"&J472&\"・\"&K472&\"・\"&L472,IF(N472=\"\",I472&\"・\"&J472&\"・\"&K472&\"・\"&L472&\"・\"&M472,I472&\"・\"&J472&\"・\"&K472&\"・\"&L472&\"・\"&M472&\"・\"&N472))))))","v":""},"","","","",""]
[null,{"$f":"データリスト!AC$46","v":"ライフプランセミナー"},{"$f":"IF(データリスト!$AC51=\"\",\"\",データリスト!$AC51)","v":""},{"$nulls":17},{"$f":"IF(I473:N473=\"\",\"\",IF(J473:N473=\"\",I473,IF(K473:N473=\"\",I473&\"・\"&J473,IF(L473:N473=\"\",I473&\"・\"&J473&\"・\"&K473,IF(M473:N473=\"\",I473&\"・\"&J473&\"・\"&K473&\"・\"&L473,IF(N473=\"\",I473&\"・\"&J473&\"・\"&K473&\"・\"&L473&\"・\"&M473,I473&\"・\"&J473&\"・\"&K473&\"・\"&L473&\"・\"&M473&\"・\"&N473))))))","v":""},"","","","",""]
[null,{"$f":"データリスト!AC$46","v":"ライフプランセミナー"},{"$f":"IF(データリスト!$AC52=\"\",\"\",データリスト!$AC52)","v":""},{"$nulls":17},{"$f":"IF(I474:N474=\"\",\"\",IF(J474:N474=\"\",I474,IF(K474:N474=\"\",I474&\"・\"&J474,IF(L474:N474=\"\",I474&\"・\"&J474&\"・\"&K474,IF(M474:N474=\"\",I474&\"・\"&J474&\"・\"&K474&\"・\"&L474,IF(N474=\"\",I474&\"・\"&J474&\"・\"&K474&\"・\"&L474&\"・\"&M474,I474&\"・\"&J474&\"・\"&K474&\"・\"&L474&\"・\"&M474&\"・\"&N474))))))","v":""},"","","","",""]
[null,{"$f":"データリスト!AC$46","v":"ライフプランセミナー"},{"$f":"IF(データリスト!$AC53=\"\",\"\",データリスト!$AC53)","v":""},{"$nulls":17},{"$f":"IF(I475:N475=\"\",\"\",IF(J475:N475=\"\",I475,IF(K475:N475=\"\",I475&\"・\"&J475,IF(L475:N475=\"\",I475&\"・\"&J475&\"・\"&K475,IF(M475:N475=\"\",I475&\"・\"&J475&\"・\"&K475&\"・\"&L475,IF(N475=\"\",I475&\"・\"&J475&\"・\"&K475&\"・\"&L475&\"・\"&M475,I475&\"・\"&J475&\"・\"&K475&\"・\"&L475&\"・\"&M475&\"・\"&N475))))))","v":""},"","","","",""]
[null,{"$f":"データリスト!AC$46","v":"ライフプランセミナー"},{"$f":"IF(データリスト!$AC54=\"\",\"\",データリスト!$AC54)","v":""},{"$nulls":17},{"$f":"IF(I476:N476=\"\",\"\",IF(J476:N476=\"\",I476,IF(K476:N476=\"\",I476&\"・\"&J476,IF(L476:N476=\"\",I476&\"・\"&J476&\"・\"&K476,IF(M476:N476=\"\",I476&\"・\"&J476&\"・\"&K476&\"・\"&L476,IF(N476=\"\",I476&\"・\"&J476&\"・\"&K476&\"・\"&L476&\"・\"&M476,I476&\"・\"&J476&\"・\"&K476&\"・\"&L476&\"・\"&M476&\"・\"&N476))))))","v":""},"","","","",""]
[null,{"$f":"データリスト!AC$46","v":"ライフプランセミナー"},{"$f":"IF(データリスト!$AC55=\"\",\"\",データリスト!$AC55)","v":""},{"$nulls":17},{"$f":"IF(I477:N477=\"\",\"\",IF(J477:N477=\"\",I477,IF(K477:N477=\"\",I477&\"・\"&J477,IF(L477:N477=\"\",I477&\"・\"&J477&\"・\"&K477,IF(M477:N477=\"\",I477&\"・\"&J477&\"・\"&K477&\"・\"&L477,IF(N477=\"\",I477&\"・\"&J477&\"・\"&K477&\"・\"&L477&\"・\"&M477,I477&\"・\"&J477&\"・\"&K477&\"・\"&L477&\"・\"&M477&\"・\"&N477))))))","v":""},"","","","",""]
[null,{"$f":"データリスト!AC$46","v":"ライフプランセミナー"},{"$f":"IF(データリスト!$AC56=\"\",\"\",データリスト!$AC56)","v":""},{"$nulls":17},{"$f":"IF(I478:N478=\"\",\"\",IF(J478:N478=\"\",I478,IF(K478:N478=\"\",I478&\"・\"&J478,IF(L478:N478=\"\",I478&\"・\"&J478&\"・\"&K478,IF(M478:N478=\"\",I478&\"・\"&J478&\"・\"&K478&\"・\"&L478,IF(N478=\"\",I478&\"・\"&J478&\"・\"&K478&\"・\"&L478&\"・\"&M478,I478&\"・\"&J478&\"・\"&K478&\"・\"&L478&\"・\"&M478&\"・\"&N478))))))","v":""},"","","","",""]
[null,{"$f":"データリスト!AC$46","v":"ライフプランセミナー"},{"$f":"IF(データリスト!$AC57=\"\",\"\",データリスト!$AC57)","v":""},{"$nulls":17},{"$f":"IF(I479:N479=\"\",\"\",IF(J479:N479=\"\",I479,IF(K479:N479=\"\",I479&\"・\"&J479,IF(L479:N479=\"\",I479&\"・\"&J479&\"・\"&K479,IF(M479:N479=\"\",I479&\"・\"&J479&\"・\"&K479&\"・\"&L479,IF(N479=\"\",I479&\"・\"&J479&\"・\"&K479&\"・\"&L479&\"・\"&M479,I479&\"・\"&J479&\"・\"&K479&\"・\"&L479&\"・\"&M479&\"・\"&N479))))))","v":""},"","","","",""]
[null,{"$f":"データリスト!AC$46","v":"ライフプランセミナー"},{"$f":"IF(データリスト!$AC58=\"\",\"\",データリスト!$AC58)","v":""},{"$nulls":17},{"$f":"IF(I480:N480=\"\",\"\",IF(J480:N480=\"\",I480,IF(K480:N480=\"\",I480&\"・\"&J480,IF(L480:N480=\"\",I480&\"・\"&J480&\"・\"&K480,IF(M480:N480=\"\",I480&\"・\"&J480&\"・\"&K480&\"・\"&L480,IF(N480=\"\",I480&\"・\"&J480&\"・\"&K480&\"・\"&L480&\"・\"&M480,I480&\"・\"&J480&\"・\"&K480&\"・\"&L480&\"・\"&M480&\"・\"&N480))))))","v":""},"","","","",""]
[null,{"$f":"データリスト!AC$46","v":"ライフプランセミナー"},{"$f":"IF(データリスト!$AC59=\"\",\"\",データリスト!$AC59)","v":""},{"$nulls":17},{"$f":"IF(I481:N481=\"\",\"\",IF(J481:N481=\"\",I481,IF(K481:N481=\"\",I481&\"・\"&J481,IF(L481:N481=\"\",I481&\"・\"&J481&\"・\"&K481,IF(M481:N481=\"\",I481&\"・\"&J481&\"・\"&K481&\"・\"&L481,IF(N481=\"\",I481&\"・\"&J481&\"・\"&K481&\"・\"&L481&\"・\"&M481,I481&\"・\"&J481&\"・\"&K481&\"・\"&L481&\"・\"&M481&\"・\"&N481))))))","v":""},"","","","",""]
[null,{"$f":"データリスト!AC$46","v":"ライフプランセミナー"},{"$f":"IF(データリスト!$AC60=\"\",\"\",データリスト!$AC60)","v":""},{"$nulls":17},{"$f":"IF(I482:N482=\"\",\"\",IF(J482:N482=\"\",I482,IF(K482:N482=\"\",I482&\"・\"&J482,IF(L482:N482=\"\",I482&\"・\"&J482&\"・\"&K482,IF(M482:N482=\"\",I482&\"・\"&J482&\"・\"&K482&\"・\"&L482,IF(N482=\"\",I482&\"・\"&J482&\"・\"&K482&\"・\"&L482&\"・\"&M482,I482&\"・\"&J482&\"・\"&K482&\"・\"&L482&\"・\"&M482&\"・\"&N482))))))","v":""},"","","","",""]
[null,{"$f":"データリスト!AC$46","v":"ライフプランセミナー"},{"$f":"IF(データリスト!$AC61=\"\",\"\",データリスト!$AC61)","v":""},{"$nulls":17},{"$f":"IF(I483:N483=\"\",\"\",IF(J483:N483=\"\",I483,IF(K483:N483=\"\",I483&\"・\"&J483,IF(L483:N483=\"\",I483&\"・\"&J483&\"・\"&K483,IF(M483:N483=\"\",I483&\"・\"&J483&\"・\"&K483&\"・\"&L483,IF(N483=\"\",I483&\"・\"&J483&\"・\"&K483&\"・\"&L483&\"・\"&M483,I483&\"・\"&J483&\"・\"&K483&\"・\"&L483&\"・\"&M483&\"・\"&N483))))))","v":""},"","","","",""]
[null,{"$f":"データリスト!AC$46","v":"ライフプランセミナー"},{"$f":"IF(データリスト!$AC62=\"\",\"\",データリスト!$AC62)","v":""},{"$nulls":17},{"$f":"IF(I484:N484=\"\",\"\",IF(J484:N484=\"\",I484,IF(K484:N484=\"\",I484&\"・\"&J484,IF(L484:N484=\"\",I484&\"・\"&J484&\"・\"&K484,IF(M484:N484=\"\",I484&\"・\"&J484&\"・\"&K484&\"・\"&L484,IF(N484=\"\",I484&\"・\"&J484&\"・\"&K484&\"・\"&L484&\"・\"&M484,I484&\"・\"&J484&\"・\"&K484&\"・\"&L484&\"・\"&M484&\"・\"&N484))))))","v":""},"","","","",""]
[null,{"$f":"データリスト!AC$46","v":"ライフプランセミナー"},{"$f":"IF(データリスト!$AC63=\"\",\"\",データリスト!$AC63)","v":""},{"$nulls":17},{"$f":"IF(I485:N485=\"\",\"\",IF(J485:N485=\"\",I485,IF(K485:N485=\"\",I485&\"・\"&J485,IF(L485:N485=\"\",I485&\"・\"&J485&\"・\"&K485,IF(M485:N485=\"\",I485&\"・\"&J485&\"・\"&K485&\"・\"&L485,IF(N485=\"\",I485&\"・\"&J485&\"・\"&K485&\"・\"&L485&\"・\"&M485,I485&\"・\"&J485&\"・\"&K485&\"・\"&L485&\"・\"&M485&\"・\"&N485))))))","v":""},"","","","",""]
[null,{"$f":"データリスト!AC$46","v":"ライフプランセミナー"},{"$f":"IF(データリスト!$AC64=\"\",\"\",データリスト!$AC64)","v":""},{"$nulls":17},{"$f":"IF(I486:N486=\"\",\"\",IF(J486:N486=\"\",I486,IF(K486:N486=\"\",I486&\"・\"&J486,IF(L486:N486=\"\",I486&\"・\"&J486&\"・\"&K486,IF(M486:N486=\"\",I486&\"・\"&J486&\"・\"&K486&\"・\"&L486,IF(N486=\"\",I486&\"・\"&J486&\"・\"&K486&\"・\"&L486&\"・\"&M486,I486&\"・\"&J486&\"・\"&K486&\"・\"&L486&\"・\"&M486&\"・\"&N486))))))","v":""},"","","","",""]
[null,{"$f":"データリスト!AC$46","v":"ライフプランセミナー"},{"$f":"IF(データリスト!$AC65=\"\",\"\",データリスト!$AC65)","v":""},{"$nulls":17},{"$f":"IF(I487:N487=\"\",\"\",IF(J487:N487=\"\",I487,IF(K487:N487=\"\",I487&\"・\"&J487,IF(L487:N487=\"\",I487&\"・\"&J487&\"・\"&K487,IF(M487:N487=\"\",I487&\"・\"&J487&\"・\"&K487&\"・\"&L487,IF(N487=\"\",I487&\"・\"&J487&\"・\"&K487&\"・\"&L487&\"・\"&M487,I487&\"・\"&J487&\"・\"&K487&\"・\"&L487&\"・\"&M487&\"・\"&N487))))))","v":""},"","","","",""]
[null,{"$f":"データリスト!AC$46","v":"ライフプランセミナー"},{"$f":"IF(データリスト!$AC66=\"\",\"\",データリスト!$AC66)","v":""},{"$nulls":17},{"$f":"IF(I488:N488=\"\",\"\",IF(J488:N488=\"\",I488,IF(K488:N488=\"\",I488&\"・\"&J488,IF(L488:N488=\"\",I488&\"・\"&J488&\"・\"&K488,IF(M488:N488=\"\",I488&\"・\"&J488&\"・\"&K488&\"・\"&L488,IF(N488=\"\",I488&\"・\"&J488&\"・\"&K488&\"・\"&L488&\"・\"&M488,I488&\"・\"&J488&\"・\"&K488&\"・\"&L488&\"・\"&M488&\"・\"&N488))))))","v":""},"","","","",""]
[null,{"$f":"データリスト!AD$46","v":"外部団体主催の教育"},{"$f":"IF(データリスト!$AD47=\"\",\"\",データリスト!$AD47)","v":"ユースリーダーセミナー"},{"$nulls":17},{"$f":"IF(I489:N489=\"\",\"\",IF(J489:N489=\"\",I489,IF(K489:N489=\"\",I489&\"・\"&J489,IF(L489:N489=\"\",I489&\"・\"&J489&\"・\"&K489,IF(M489:N489=\"\",I489&\"・\"&J489&\"・\"&K489&\"・\"&L489,IF(N489=\"\",I489&\"・\"&J489&\"・\"&K489&\"・\"&L489&\"・\"&M489,I489&\"・\"&J489&\"・\"&K489&\"・\"&L489&\"・\"&M489&\"・\"&N489))))))","v":""},"","","","",""]
[null,{"$f":"データリスト!AD$46","v":"外部団体主催の教育"},{"$f":"IF(データリスト!$AD48=\"\",\"\",データリスト!$AD48)","v":"ﾕﾆｵﾝﾘｰﾀﾞｰｽｸｰﾙ"},{"$nulls":17},{"$f":"IF(I490:N490=\"\",\"\",IF(J490:N490=\"\",I490,IF(K490:N490=\"\",I490&\"・\"&J490,IF(L490:N490=\"\",I490&\"・\"&J490&\"・\"&K490,IF(M490:N490=\"\",I490&\"・\"&J490&\"・\"&K490&\"・\"&L490,IF(N490=\"\",I490&\"・\"&J490&\"・\"&K490&\"・\"&L490&\"・\"&M490,I490&\"・\"&J490&\"・\"&K490&\"・\"&L490&\"・\"&M490&\"・\"&N490))))))","v":""},"","","","",""]
[null,{"$f":"データリスト!AD$46","v":"外部団体主催の教育"},{"$f":"IF(データリスト!$AD49=\"\",\"\",データリスト!$AD49)","v":"県総連要請　研修会"},{"$nulls":17},{"$f":"IF(I491:N491=\"\",\"\",IF(J491:N491=\"\",I491,IF(K491:N491=\"\",I491&\"・\"&J491,IF(L491:N491=\"\",I491&\"・\"&J491&\"・\"&K491,IF(M491:N491=\"\",I491&\"・\"&J491&\"・\"&K491&\"・\"&L491,IF(N491=\"\",I491&\"・\"&J491&\"・\"&K491&\"・\"&L491&\"・\"&M491,I491&\"・\"&J491&\"・\"&K491&\"・\"&L491&\"・\"&M491&\"・\"&N491))))))","v":""},"","","","",""]
[null,{"$f":"データリスト!AD$46","v":"外部団体主催の教育"},{"$f":"IF(データリスト!$AD50=\"\",\"\",データリスト!$AD50)","v":""},{"$nulls":17},{"$f":"IF(I492:N492=\"\",\"\",IF(J492:N492=\"\",I492,IF(K492:N492=\"\",I492&\"・\"&J492,IF(L492:N492=\"\",I492&\"・\"&J492&\"・\"&K492,IF(M492:N492=\"\",I492&\"・\"&J492&\"・\"&K492&\"・\"&L492,IF(N492=\"\",I492&\"・\"&J492&\"・\"&K492&\"・\"&L492&\"・\"&M492,I492&\"・\"&J492&\"・\"&K492&\"・\"&L492&\"・\"&M492&\"・\"&N492))))))","v":""},"","","","",""]
[null,{"$f":"データリスト!AD$46","v":"外部団体主催の教育"},{"$f":"IF(データリスト!$AD51=\"\",\"\",データリスト!$AD51)","v":""},{"$nulls":17},{"$f":"IF(I493:N493=\"\",\"\",IF(J493:N493=\"\",I493,IF(K493:N493=\"\",I493&\"・\"&J493,IF(L493:N493=\"\",I493&\"・\"&J493&\"・\"&K493,IF(M493:N493=\"\",I493&\"・\"&J493&\"・\"&K493&\"・\"&L493,IF(N493=\"\",I493&\"・\"&J493&\"・\"&K493&\"・\"&L493&\"・\"&M493,I493&\"・\"&J493&\"・\"&K493&\"・\"&L493&\"・\"&M493&\"・\"&N493))))))","v":""},"","","","",""]
[null,{"$f":"データリスト!AD$46","v":"外部団体主催の教育"},{"$f":"IF(データリスト!$AD52=\"\",\"\",データリスト!$AD52)","v":""},{"$nulls":17},{"$f":"IF(I494:N494=\"\",\"\",IF(J494:N494=\"\",I494,IF(K494:N494=\"\",I494&\"・\"&J494,IF(L494:N494=\"\",I494&\"・\"&J494&\"・\"&K494,IF(M494:N494=\"\",I494&\"・\"&J494&\"・\"&K494&\"・\"&L494,IF(N494=\"\",I494&\"・\"&J494&\"・\"&K494&\"・\"&L494&\"・\"&M494,I494&\"・\"&J494&\"・\"&K494&\"・\"&L494&\"・\"&M494&\"・\"&N494))))))","v":""},"","","","",""]
[null,{"$f":"データリスト!AD$46","v":"外部団体主催の教育"},{"$f":"IF(データリスト!$AD53=\"\",\"\",データリスト!$AD53)","v":""},{"$nulls":17},{"$f":"IF(I495:N495=\"\",\"\",IF(J495:N495=\"\",I495,IF(K495:N495=\"\",I495&\"・\"&J495,IF(L495:N495=\"\",I495&\"・\"&J495&\"・\"&K495,IF(M495:N495=\"\",I495&\"・\"&J495&\"・\"&K495&\"・\"&L495,IF(N495=\"\",I495&\"・\"&J495&\"・\"&K495&\"・\"&L495&\"・\"&M495,I495&\"・\"&J495&\"・\"&K495&\"・\"&L495&\"・\"&M495&\"・\"&N495))))))","v":""},"","","","",""]
[null,{"$f":"データリスト!AD$46","v":"外部団体主催の教育"},{"$f":"IF(データリスト!$AD54=\"\",\"\",データリスト!$AD54)","v":""},{"$nulls":17},{"$f":"IF(I496:N496=\"\",\"\",IF(J496:N496=\"\",I496,IF(K496:N496=\"\",I496&\"・\"&J496,IF(L496:N496=\"\",I496&\"・\"&J496&\"・\"&K496,IF(M496:N496=\"\",I496&\"・\"&J496&\"・\"&K496&\"・\"&L496,IF(N496=\"\",I496&\"・\"&J496&\"・\"&K496&\"・\"&L496&\"・\"&M496,I496&\"・\"&J496&\"・\"&K496&\"・\"&L496&\"・\"&M496&\"・\"&N496))))))","v":""},"","","","",""]
[null,{"$f":"データリスト!AD$46","v":"外部団体主催の教育"},{"$f":"IF(データリスト!$AD55=\"\",\"\",データリスト!$AD55)","v":""},{"$nulls":17},{"$f":"IF(I497:N497=\"\",\"\",IF(J497:N497=\"\",I497,IF(K497:N497=\"\",I497&\"・\"&J497,IF(L497:N497=\"\",I497&\"・\"&J497&\"・\"&K497,IF(M497:N497=\"\",I497&\"・\"&J497&\"・\"&K497&\"・\"&L497,IF(N497=\"\",I497&\"・\"&J497&\"・\"&K497&\"・\"&L497&\"・\"&M497,I497&\"・\"&J497&\"・\"&K497&\"・\"&L497&\"・\"&M497&\"・\"&N497))))))","v":""},"","","","",""]
[null,{"$f":"データリスト!AD$46","v":"外部団体主催の教育"},{"$f":"IF(データリスト!$AD56=\"\",\"\",データリスト!$AD56)","v":""},{"$nulls":17},{"$f":"IF(I498:N498=\"\",\"\",IF(J498:N498=\"\",I498,IF(K498:N498=\"\",I498&\"・\"&J498,IF(L498:N498=\"\",I498&\"・\"&J498&\"・\"&K498,IF(M498:N498=\"\",I498&\"・\"&J498&\"・\"&K498&\"・\"&L498,IF(N498=\"\",I498&\"・\"&J498&\"・\"&K498&\"・\"&L498&\"・\"&M498,I498&\"・\"&J498&\"・\"&K498&\"・\"&L498&\"・\"&M498&\"・\"&N498))))))","v":""},"","","","",""]
[null,{"$f":"データリスト!AD$46","v":"外部団体主催の教育"},{"$f":"IF(データリスト!$AD57=\"\",\"\",データリスト!$AD57)","v":""},{"$nulls":17},{"$f":"IF(I499:N499=\"\",\"\",IF(J499:N499=\"\",I499,IF(K499:N499=\"\",I499&\"・\"&J499,IF(L499:N499=\"\",I499&\"・\"&J499&\"・\"&K499,IF(M499:N499=\"\",I499&\"・\"&J499&\"・\"&K499&\"・\"&L499,IF(N499=\"\",I499&\"・\"&J499&\"・\"&K499&\"・\"&L499&\"・\"&M499,I499&\"・\"&J499&\"・\"&K499&\"・\"&L499&\"・\"&M499&\"・\"&N499))))))","v":""},"","","","",""]
[null,{"$f":"データリスト!AD$46","v":"外部団体主催の教育"},{"$f":"IF(データリスト!$AD58=\"\",\"\",データリスト!$AD58)","v":""},{"$nulls":17},{"$f":"IF(I500:N500=\"\",\"\",IF(J500:N500=\"\",I500,IF(K500:N500=\"\",I500&\"・\"&J500,IF(L500:N500=\"\",I500&\"・\"&J500&\"・\"&K500,IF(M500:N500=\"\",I500&\"・\"&J500&\"・\"&K500&\"・\"&L500,IF(N500=\"\",I500&\"・\"&J500&\"・\"&K500&\"・\"&L500&\"・\"&M500,I500&\"・\"&J500&\"・\"&K500&\"・\"&L500&\"・\"&M500&\"・\"&N500))))))","v":""},"","","","",""]
[null,{"$f":"データリスト!AD$46","v":"外部団体主催の教育"},{"$f":"IF(データリスト!$AD59=\"\",\"\",データリスト!$AD59)","v":""},{"$nulls":17},{"$f":"IF(I501:N501=\"\",\"\",IF(J501:N501=\"\",I501,IF(K501:N501=\"\",I501&\"・\"&J501,IF(L501:N501=\"\",I501&\"・\"&J501&\"・\"&K501,IF(M501:N501=\"\",I501&\"・\"&J501&\"・\"&K501&\"・\"&L501,IF(N501=\"\",I501&\"・\"&J501&\"・\"&K501&\"・\"&L501&\"・\"&M501,I501&\"・\"&J501&\"・\"&K501&\"・\"&L501&\"・\"&M501&\"・\"&N501))))))","v":""},"","","","",""]
[null,{"$f":"データリスト!AD$46","v":"外部団体主催の教育"},{"$f":"IF(データリスト!$AD60=\"\",\"\",データリスト!$AD60)","v":""},{"$nulls":17},{"$f":"IF(I502:N502=\"\",\"\",IF(J502:N502=\"\",I502,IF(K502:N502=\"\",I502&\"・\"&J502,IF(L502:N502=\"\",I502&\"・\"&J502&\"・\"&K502,IF(M502:N502=\"\",I502&\"・\"&J502&\"・\"&K502&\"・\"&L502,IF(N502=\"\",I502&\"・\"&J502&\"・\"&K502&\"・\"&L502&\"・\"&M502,I502&\"・\"&J502&\"・\"&K502&\"・\"&L502&\"・\"&M502&\"・\"&N502))))))","v":""},"","","","",""]
[null,{"$f":"データリスト!AD$46","v":"外部団体主催の教育"},{"$f":"IF(データリスト!$AD61=\"\",\"\",データリスト!$AD61)","v":""},{"$nulls":17},{"$f":"IF(I503:N503=\"\",\"\",IF(J503:N503=\"\",I503,IF(K503:N503=\"\",I503&\"・\"&J503,IF(L503:N503=\"\",I503&\"・\"&J503&\"・\"&K503,IF(M503:N503=\"\",I503&\"・\"&J503&\"・\"&K503&\"・\"&L503,IF(N503=\"\",I503&\"・\"&J503&\"・\"&K503&\"・\"&L503&\"・\"&M503,I503&\"・\"&J503&\"・\"&K503&\"・\"&L503&\"・\"&M503&\"・\"&N503))))))","v":""},"","","","",""]
[null,{"$f":"データリスト!AD$46","v":"外部団体主催の教育"},{"$f":"IF(データリスト!$AD62=\"\",\"\",データリスト!$AD62)","v":""},{"$nulls":17},{"$f":"IF(I504:N504=\"\",\"\",IF(J504:N504=\"\",I504,IF(K504:N504=\"\",I504&\"・\"&J504,IF(L504:N504=\"\",I504&\"・\"&J504&\"・\"&K504,IF(M504:N504=\"\",I504&\"・\"&J504&\"・\"&K504&\"・\"&L504,IF(N504=\"\",I504&\"・\"&J504&\"・\"&K504&\"・\"&L504&\"・\"&M504,I504&\"・\"&J504&\"・\"&K504&\"・\"&L504&\"・\"&M504&\"・\"&N504))))))","v":""},"","","","",""]
[null,{"$f":"データリスト!AD$46","v":"外部団体主催の教育"},{"$f":"IF(データリスト!$AD63=\"\",\"\",データリスト!$AD63)","v":""},{"$nulls":17},{"$f":"IF(I505:N505=\"\",\"\",IF(J505:N505=\"\",I505,IF(K505:N505=\"\",I505&\"・\"&J505,IF(L505:N505=\"\",I505&\"・\"&J505&\"・\"&K505,IF(M505:N505=\"\",I505&\"・\"&J505&\"・\"&K505&\"・\"&L505,IF(N505=\"\",I505&\"・\"&J505&\"・\"&K505&\"・\"&L505&\"・\"&M505,I505&\"・\"&J505&\"・\"&K505&\"・\"&L505&\"・\"&M505&\"・\"&N505))))))","v":""},"","","","",""]
[null,{"$f":"データリスト!AD$46","v":"外部団体主催の教育"},{"$f":"IF(データリスト!$AD64=\"\",\"\",データリスト!$AD64)","v":""},{"$nulls":17},{"$f":"IF(I506:N506=\"\",\"\",IF(J506:N506=\"\",I506,IF(K506:N506=\"\",I506&\"・\"&J506,IF(L506:N506=\"\",I506&\"・\"&J506&\"・\"&K506,IF(M506:N506=\"\",I506&\"・\"&J506&\"・\"&K506&\"・\"&L506,IF(N506=\"\",I506&\"・\"&J506&\"・\"&K506&\"・\"&L506&\"・\"&M506,I506&\"・\"&J506&\"・\"&K506&\"・\"&L506&\"・\"&M506&\"・\"&N506))))))","v":""},"","","","",""]
[null,{"$f":"データリスト!AD$46","v":"外部団体主催の教育"},{"$f":"IF(データリスト!$AD65=\"\",\"\",データリスト!$AD65)","v":""},{"$nulls":17},{"$f":"IF(I507:N507=\"\",\"\",IF(J507:N507=\"\",I507,IF(K507:N507=\"\",I507&\"・\"&J507,IF(L507:N507=\"\",I507&\"・\"&J507&\"・\"&K507,IF(M507:N507=\"\",I507&\"・\"&J507&\"・\"&K507&\"・\"&L507,IF(N507=\"\",I507&\"・\"&J507&\"・\"&K507&\"・\"&L507&\"・\"&M507,I507&\"・\"&J507&\"・\"&K507&\"・\"&L507&\"・\"&M507&\"・\"&N507))))))","v":""},"","","","",""]
[null,{"$f":"データリスト!AD$46","v":"外部団体主催の教育"},{"$f":"IF(データリスト!$AD66=\"\",\"\",データリスト!$AD66)","v":""},{"$nulls":17},{"$f":"IF(I508:N508=\"\",\"\",IF(J508:N508=\"\",I508,IF(K508:N508=\"\",I508&\"・\"&J508,IF(L508:N508=\"\",I508&\"・\"&J508&\"・\"&K508,IF(M508:N508=\"\",I508&\"・\"&J508&\"・\"&K508&\"・\"&L508,IF(N508=\"\",I508&\"・\"&J508&\"・\"&K508&\"・\"&L508&\"・\"&M508,I508&\"・\"&J508&\"・\"&K508&\"・\"&L508&\"・\"&M508&\"・\"&N508))))))","v":""},"","","","",""]
[null,{"$f":"データリスト!AE$46","v":"地協・県総連"},{"$f":"IF(データリスト!$AE47=\"\",\"\",データリスト!$AE47)","v":"参加人数集約・報告"},{"$nulls":17},{"$f":"IF(I509:N509=\"\",\"\",IF(J509:N509=\"\",I509,IF(K509:N509=\"\",I509&\"・\"&J509,IF(L509:N509=\"\",I509&\"・\"&J509&\"・\"&K509,IF(M509:N509=\"\",I509&\"・\"&J509&\"・\"&K509&\"・\"&L509,IF(N509=\"\",I509&\"・\"&J509&\"・\"&K509&\"・\"&L509&\"・\"&M509,I509&\"・\"&J509&\"・\"&K509&\"・\"&L509&\"・\"&M509&\"・\"&N509))))))","v":""},"","","","",""]
[null,{"$f":"データリスト!AE$46","v":"地協・県総連"},{"$f":"IF(データリスト!$AE48=\"\",\"\",データリスト!$AE48)","v":"・メーデー"},{"$nulls":17},{"$f":"IF(I510:N510=\"\",\"\",IF(J510:N510=\"\",I510,IF(K510:N510=\"\",I510&\"・\"&J510,IF(L510:N510=\"\",I510&\"・\"&J510&\"・\"&K510,IF(M510:N510=\"\",I510&\"・\"&J510&\"・\"&K510&\"・\"&L510,IF(N510=\"\",I510&\"・\"&J510&\"・\"&K510&\"・\"&L510&\"・\"&M510,I510&\"・\"&J510&\"・\"&K510&\"・\"&L510&\"・\"&M510&\"・\"&N510))))))","v":""},"","","","",""]
[null,{"$f":"データリスト!AE$46","v":"地協・県総連"},{"$f":"IF(データリスト!$AE49=\"\",\"\",データリスト!$AE49)","v":"・中央・各地区決起集会"},{"$nulls":17},{"$f":"IF(I511:N511=\"\",\"\",IF(J511:N511=\"\",I511,IF(K511:N511=\"\",I511&\"・\"&J511,IF(L511:N511=\"\",I511&\"・\"&J511&\"・\"&K511,IF(M511:N511=\"\",I511&\"・\"&J511&\"・\"&K511&\"・\"&L511,IF(N511=\"\",I511&\"・\"&J511&\"・\"&K511&\"・\"&L511&\"・\"&M511,I511&\"・\"&J511&\"・\"&K511&\"・\"&L511&\"・\"&M511&\"・\"&N511))))))","v":""},"","","","",""]
[null,{"$f":"データリスト!AE$46","v":"地協・県総連"},{"$f":"IF(データリスト!$AE50=\"\",\"\",データリスト!$AE50)","v":"・地協代表者会議・幹事会"},{"$nulls":17},{"$f":"IF(I512:N512=\"\",\"\",IF(J512:N512=\"\",I512,IF(K512:N512=\"\",I512&\"・\"&J512,IF(L512:N512=\"\",I512&\"・\"&J512&\"・\"&K512,IF(M512:N512=\"\",I512&\"・\"&J512&\"・\"&K512&\"・\"&L512,IF(N512=\"\",I512&\"・\"&J512&\"・\"&K512&\"・\"&L512&\"・\"&M512,I512&\"・\"&J512&\"・\"&K512&\"・\"&L512&\"・\"&M512&\"・\"&N512))))))","v":""},"","","","",""]
[null,{"$f":"データリスト!AE$46","v":"地協・県総連"},{"$f":"IF(データリスト!$AE51=\"\",\"\",データリスト!$AE51)","v":"県総連　青年女性委員会"},{"$nulls":17},{"$f":"IF(I513:N513=\"\",\"\",IF(J513:N513=\"\",I513,IF(K513:N513=\"\",I513&\"・\"&J513,IF(L513:N513=\"\",I513&\"・\"&J513&\"・\"&K513,IF(M513:N513=\"\",I513&\"・\"&J513&\"・\"&K513&\"・\"&L513,IF(N513=\"\",I513&\"・\"&J513&\"・\"&K513&\"・\"&L513&\"・\"&M513,I513&\"・\"&J513&\"・\"&K513&\"・\"&L513&\"・\"&M513&\"・\"&N513))))))","v":""},"","","","",""]
[null,{"$f":"データリスト!AE$46","v":"地協・県総連"},{"$f":"IF(データリスト!$AE52=\"\",\"\",データリスト!$AE52)","v":"集約・報告"},{"$nulls":17},{"$f":"IF(I514:N514=\"\",\"\",IF(J514:N514=\"\",I514,IF(K514:N514=\"\",I514&\"・\"&J514,IF(L514:N514=\"\",I514&\"・\"&J514&\"・\"&K514,IF(M514:N514=\"\",I514&\"・\"&J514&\"・\"&K514&\"・\"&L514,IF(N514=\"\",I514&\"・\"&J514&\"・\"&K514&\"・\"&L514&\"・\"&M514,I514&\"・\"&J514&\"・\"&K514&\"・\"&L514&\"・\"&M514&\"・\"&N514))))))","v":""},"","","","",""]
[null,{"$f":"データリスト!AE$46","v":"地協・県総連"},{"$f":"IF(データリスト!$AE53=\"\",\"\",データリスト!$AE53)","v":"県総連　青年女性イベント"},{"$nulls":17},{"$f":"IF(I515:N515=\"\",\"\",IF(J515:N515=\"\",I515,IF(K515:N515=\"\",I515&\"・\"&J515,IF(L515:N515=\"\",I515&\"・\"&J515&\"・\"&K515,IF(M515:N515=\"\",I515&\"・\"&J515&\"・\"&K515&\"・\"&L515,IF(N515=\"\",I515&\"・\"&J515&\"・\"&K515&\"・\"&L515&\"・\"&M515,I515&\"・\"&J515&\"・\"&K515&\"・\"&L515&\"・\"&M515&\"・\"&N515))))))","v":""},"","","","",""]
[null,{"$f":"データリスト!AE$46","v":"地協・県総連"},{"$f":"IF(データリスト!$AE54=\"\",\"\",データリスト!$AE54)","v":"集約・報告"},{"$nulls":17},{"$f":"IF(I516:N516=\"\",\"\",IF(J516:N516=\"\",I516,IF(K516:N516=\"\",I516&\"・\"&J516,IF(L516:N516=\"\",I516&\"・\"&J516&\"・\"&K516,IF(M516:N516=\"\",I516&\"・\"&J516&\"・\"&K516&\"・\"&L516,IF(N516=\"\",I516&\"・\"&J516&\"・\"&K516&\"・\"&L516&\"・\"&M516,I516&\"・\"&J516&\"・\"&K516&\"・\"&L516&\"・\"&M516&\"・\"&N516))))))","v":""},"","","","",""]
[null,{"$f":"データリスト!AE$46","v":"地協・県総連"},{"$f":"IF(データリスト!$AE55=\"\",\"\",データリスト!$AE55)","v":""},{"$nulls":17},{"$f":"IF(I517:N517=\"\",\"\",IF(J517:N517=\"\",I517,IF(K517:N517=\"\",I517&\"・\"&J517,IF(L517:N517=\"\",I517&\"・\"&J517&\"・\"&K517,IF(M517:N517=\"\",I517&\"・\"&J517&\"・\"&K517&\"・\"&L517,IF(N517=\"\",I517&\"・\"&J517&\"・\"&K517&\"・\"&L517&\"・\"&M517,I517&\"・\"&J517&\"・\"&K517&\"・\"&L517&\"・\"&M517&\"・\"&N517))))))","v":""},"","","","",""]
[null,{"$f":"データリスト!AE$46","v":"地協・県総連"},{"$f":"IF(データリスト!$AE56=\"\",\"\",データリスト!$AE56)","v":""},{"$nulls":17},{"$f":"IF(I518:N518=\"\",\"\",IF(J518:N518=\"\",I518,IF(K518:N518=\"\",I518&\"・\"&J518,IF(L518:N518=\"\",I518&\"・\"&J518&\"・\"&K518,IF(M518:N518=\"\",I518&\"・\"&J518&\"・\"&K518&\"・\"&L518,IF(N518=\"\",I518&\"・\"&J518&\"・\"&K518&\"・\"&L518&\"・\"&M518,I518&\"・\"&J518&\"・\"&K518&\"・\"&L518&\"・\"&M518&\"・\"&N518))))))","v":""},"","","","",""]
[null,{"$f":"データリスト!AE$46","v":"地協・県総連"},{"$f":"IF(データリスト!$AE57=\"\",\"\",データリスト!$AE57)","v":""},{"$nulls":17},{"$f":"IF(I519:N519=\"\",\"\",IF(J519:N519=\"\",I519,IF(K519:N519=\"\",I519&\"・\"&J519,IF(L519:N519=\"\",I519&\"・\"&J519&\"・\"&K519,IF(M519:N519=\"\",I519&\"・\"&J519&\"・\"&K519&\"・\"&L519,IF(N519=\"\",I519&\"・\"&J519&\"・\"&K519&\"・\"&L519&\"・\"&M519,I519&\"・\"&J519&\"・\"&K519&\"・\"&L519&\"・\"&M519&\"・\"&N519))))))","v":""},"","","","",""]
[null,{"$f":"データリスト!AE$46","v":"地協・県総連"},{"$f":"IF(データリスト!$AE58=\"\",\"\",データリスト!$AE58)","v":""},{"$nulls":17},{"$f":"IF(I520:N520=\"\",\"\",IF(J520:N520=\"\",I520,IF(K520:N520=\"\",I520&\"・\"&J520,IF(L520:N520=\"\",I520&\"・\"&J520&\"・\"&K520,IF(M520:N520=\"\",I520&\"・\"&J520&\"・\"&K520&\"・\"&L520,IF(N520=\"\",I520&\"・\"&J520&\"・\"&K520&\"・\"&L520&\"・\"&M520,I520&\"・\"&J520&\"・\"&K520&\"・\"&L520&\"・\"&M520&\"・\"&N520))))))","v":""},"","","","",""]
[null,{"$f":"データリスト!AE$46","v":"地協・県総連"},{"$f":"IF(データリスト!$AE59=\"\",\"\",データリスト!$AE59)","v":""},{"$nulls":17},{"$f":"IF(I521:N521=\"\",\"\",IF(J521:N521=\"\",I521,IF(K521:N521=\"\",I521&\"・\"&J521,IF(L521:N521=\"\",I521&\"・\"&J521&\"・\"&K521,IF(M521:N521=\"\",I521&\"・\"&J521&\"・\"&K521&\"・\"&L521,IF(N521=\"\",I521&\"・\"&J521&\"・\"&K521&\"・\"&L521&\"・\"&M521,I521&\"・\"&J521&\"・\"&K521&\"・\"&L521&\"・\"&M521&\"・\"&N521))))))","v":""},"","","","",""]
[null,{"$f":"データリスト!AE$46","v":"地協・県総連"},{"$f":"IF(データリスト!$AE60=\"\",\"\",データリスト!$AE60)","v":""},{"$nulls":17},{"$f":"IF(I522:N522=\"\",\"\",IF(J522:N522=\"\",I522,IF(K522:N522=\"\",I522&\"・\"&J522,IF(L522:N522=\"\",I522&\"・\"&J522&\"・\"&K522,IF(M522:N522=\"\",I522&\"・\"&J522&\"・\"&K522&\"・\"&L522,IF(N522=\"\",I522&\"・\"&J522&\"・\"&K522&\"・\"&L522&\"・\"&M522,I522&\"・\"&J522&\"・\"&K522&\"・\"&L522&\"・\"&M522&\"・\"&N522))))))","v":""},"","","","",""]
[null,{"$f":"データリスト!AE$46","v":"地協・県総連"},{"$f":"IF(データリスト!$AE61=\"\",\"\",データリスト!$AE61)","v":""},{"$nulls":17},{"$f":"IF(I523:N523=\"\",\"\",IF(J523:N523=\"\",I523,IF(K523:N523=\"\",I523&\"・\"&J523,IF(L523:N523=\"\",I523&\"・\"&J523&\"・\"&K523,IF(M523:N523=\"\",I523&\"・\"&J523&\"・\"&K523&\"・\"&L523,IF(N523=\"\",I523&\"・\"&J523&\"・\"&K523&\"・\"&L523&\"・\"&M523,I523&\"・\"&J523&\"・\"&K523&\"・\"&L523&\"・\"&M523&\"・\"&N523))))))","v":""},"","","","",""]
[null,{"$f":"データリスト!AE$46","v":"地協・県総連"},{"$f":"IF(データリスト!$AE62=\"\",\"\",データリスト!$AE62)","v":""},{"$nulls":17},{"$f":"IF(I524:N524=\"\",\"\",IF(J524:N524=\"\",I524,IF(K524:N524=\"\",I524&\"・\"&J524,IF(L524:N524=\"\",I524&\"・\"&J524&\"・\"&K524,IF(M524:N524=\"\",I524&\"・\"&J524&\"・\"&K524&\"・\"&L524,IF(N524=\"\",I524&\"・\"&J524&\"・\"&K524&\"・\"&L524&\"・\"&M524,I524&\"・\"&J524&\"・\"&K524&\"・\"&L524&\"・\"&M524&\"・\"&N524))))))","v":""},"","","","",""]
[null,{"$f":"データリスト!AE$46","v":"地協・県総連"},{"$f":"IF(データリスト!$AE63=\"\",\"\",データリスト!$AE63)","v":""},{"$nulls":17},{"$f":"IF(I525:N525=\"\",\"\",IF(J525:N525=\"\",I525,IF(K525:N525=\"\",I525&\"・\"&J525,IF(L525:N525=\"\",I525&\"・\"&J525&\"・\"&K525,IF(M525:N525=\"\",I525&\"・\"&J525&\"・\"&K525&\"・\"&L525,IF(N525=\"\",I525&\"・\"&J525&\"・\"&K525&\"・\"&L525&\"・\"&M525,I525&\"・\"&J525&\"・\"&K525&\"・\"&L525&\"・\"&M525&\"・\"&N525))))))","v":""},"","","","",""]
[null,{"$f":"データリスト!AE$46","v":"地協・県総連"},{"$f":"IF(データリスト!$AE64=\"\",\"\",データリスト!$AE64)","v":""},{"$nulls":17},{"$f":"IF(I526:N526=\"\",\"\",IF(J526:N526=\"\",I526,IF(K526:N526=\"\",I526&\"・\"&J526,IF(L526:N526=\"\",I526&\"・\"&J526&\"・\"&K526,IF(M526:N526=\"\",I526&\"・\"&J526&\"・\"&K526&\"・\"&L526,IF(N526=\"\",I526&\"・\"&J526&\"・\"&K526&\"・\"&L526&\"・\"&M526,I526&\"・\"&J526&\"・\"&K526&\"・\"&L526&\"・\"&M526&\"・\"&N526))))))","v":""},"","","","",""]
[null,{"$f":"データリスト!AE$46","v":"地協・県総連"},{"$f":"IF(データリスト!$AE65=\"\",\"\",データリスト!$AE65)","v":""},{"$nulls":17},{"$f":"IF(I527:N527=\"\",\"\",IF(J527:N527=\"\",I527,IF(K527:N527=\"\",I527&\"・\"&J527,IF(L527:N527=\"\",I527&\"・\"&J527&\"・\"&K527,IF(M527:N527=\"\",I527&\"・\"&J527&\"・\"&K527&\"・\"&L527,IF(N527=\"\",I527&\"・\"&J527&\"・\"&K527&\"・\"&L527&\"・\"&M527,I527&\"・\"&J527&\"・\"&K527&\"・\"&L527&\"・\"&M527&\"・\"&N527))))))","v":""},"","","","",""]
[null,{"$f":"データリスト!AE$46","v":"地協・県総連"},{"$f":"IF(データリスト!$AE66=\"\",\"\",データリスト!$AE66)","v":""},{"$nulls":17},{"$f":"IF(I528:N528=\"\",\"\",IF(J528:N528=\"\",I528,IF(K528:N528=\"\",I528&\"・\"&J528,IF(L528:N528=\"\",I528&\"・\"&J528&\"・\"&K528,IF(M528:N528=\"\",I528&\"・\"&J528&\"・\"&K528&\"・\"&L528,IF(N528=\"\",I528&\"・\"&J528&\"・\"&K528&\"・\"&L528&\"・\"&M528,I528&\"・\"&J528&\"・\"&K528&\"・\"&L528&\"・\"&M528&\"・\"&N528))))))","v":""},"","","","",""]
[null,{"$f":"データリスト!AF$46","v":"政治関連活動"},{"$f":"IF(データリスト!$AF47=\"\",\"\",データリスト!$AF47)","v":"政治研修会"},{"$nulls":17},{"$f":"IF(I529:N529=\"\",\"\",IF(J529:N529=\"\",I529,IF(K529:N529=\"\",I529&\"・\"&J529,IF(L529:N529=\"\",I529&\"・\"&J529&\"・\"&K529,IF(M529:N529=\"\",I529&\"・\"&J529&\"・\"&K529&\"・\"&L529,IF(N529=\"\",I529&\"・\"&J529&\"・\"&K529&\"・\"&L529&\"・\"&M529,I529&\"・\"&J529&\"・\"&K529&\"・\"&L529&\"・\"&M529&\"・\"&N529))))))","v":""},"","","","",""]
[null,{"$f":"データリスト!AF$46","v":"政治関連活動"},{"$f":"IF(データリスト!$AF48=\"\",\"\",データリスト!$AF48)","v":"後援会入会・紹介活動"},{"$nulls":17},{"$f":"IF(I530:N530=\"\",\"\",IF(J530:N530=\"\",I530,IF(K530:N530=\"\",I530&\"・\"&J530,IF(L530:N530=\"\",I530&\"・\"&J530&\"・\"&K530,IF(M530:N530=\"\",I530&\"・\"&J530&\"・\"&K530&\"・\"&L530,IF(N530=\"\",I530&\"・\"&J530&\"・\"&K530&\"・\"&L530&\"・\"&M530,I530&\"・\"&J530&\"・\"&K530&\"・\"&L530&\"・\"&M530&\"・\"&N530))))))","v":""},"","","","",""]
[null,{"$f":"データリスト!AF$46","v":"政治関連活動"},{"$f":"IF(データリスト!$AF49=\"\",\"\",データリスト!$AF49)","v":"ポスティング活動"},{"$nulls":17},{"$f":"IF(I531:N531=\"\",\"\",IF(J531:N531=\"\",I531,IF(K531:N531=\"\",I531&\"・\"&J531,IF(L531:N531=\"\",I531&\"・\"&J531&\"・\"&K531,IF(M531:N531=\"\",I531&\"・\"&J531&\"・\"&K531&\"・\"&L531,IF(N531=\"\",I531&\"・\"&J531&\"・\"&K531&\"・\"&L531&\"・\"&M531,I531&\"・\"&J531&\"・\"&K531&\"・\"&L531&\"・\"&M531&\"・\"&N531))))))","v":""},"","","","",""]
[null,{"$f":"データリスト!AF$46","v":"政治関連活動"},{"$f":"IF(データリスト!$AF50=\"\",\"\",データリスト!$AF50)","v":"事務所開き"},{"$nulls":17},{"$f":"IF(I532:N532=\"\",\"\",IF(J532:N532=\"\",I532,IF(K532:N532=\"\",I532&\"・\"&J532,IF(L532:N532=\"\",I532&\"・\"&J532&\"・\"&K532,IF(M532:N532=\"\",I532&\"・\"&J532&\"・\"&K532&\"・\"&L532,IF(N532=\"\",I532&\"・\"&J532&\"・\"&K532&\"・\"&L532&\"・\"&M532,I532&\"・\"&J532&\"・\"&K532&\"・\"&L532&\"・\"&M532&\"・\"&N532))))))","v":""},"","","","",""]
[null,{"$f":"データリスト!AF$46","v":"政治関連活動"},{"$f":"IF(データリスト!$AF51=\"\",\"\",データリスト!$AF51)","v":"出陣式"},{"$nulls":17},{"$f":"IF(I533:N533=\"\",\"\",IF(J533:N533=\"\",I533,IF(K533:N533=\"\",I533&\"・\"&J533,IF(L533:N533=\"\",I533&\"・\"&J533&\"・\"&K533,IF(M533:N533=\"\",I533&\"・\"&J533&\"・\"&K533&\"・\"&L533,IF(N533=\"\",I533&\"・\"&J533&\"・\"&K533&\"・\"&L533&\"・\"&M533,I533&\"・\"&J533&\"・\"&K533&\"・\"&L533&\"・\"&M533&\"・\"&N533))))))","v":""},"","","","",""]
[null,{"$f":"データリスト!AF$46","v":"政治関連活動"},{"$f":"IF(データリスト!$AF52=\"\",\"\",データリスト!$AF52)","v":"電話作戦・ウグイス"},{"$nulls":17},{"$f":"IF(I534:N534=\"\",\"\",IF(J534:N534=\"\",I534,IF(K534:N534=\"\",I534&\"・\"&J534,IF(L534:N534=\"\",I534&\"・\"&J534&\"・\"&K534,IF(M534:N534=\"\",I534&\"・\"&J534&\"・\"&K534&\"・\"&L534,IF(N534=\"\",I534&\"・\"&J534&\"・\"&K534&\"・\"&L534&\"・\"&M534,I534&\"・\"&J534&\"・\"&K534&\"・\"&L534&\"・\"&M534&\"・\"&N534))))))","v":""},"","","","",""]
[null,{"$f":"データリスト!AF$46","v":"政治関連活動"},{"$f":"IF(データリスト!$AF53=\"\",\"\",データリスト!$AF53)","v":"点検定着活動"},{"$nulls":17},{"$f":"IF(I535:N535=\"\",\"\",IF(J535:N535=\"\",I535,IF(K535:N535=\"\",I535&\"・\"&J535,IF(L535:N535=\"\",I535&\"・\"&J535&\"・\"&K535,IF(M535:N535=\"\",I535&\"・\"&J535&\"・\"&K535&\"・\"&L535,IF(N535=\"\",I535&\"・\"&J535&\"・\"&K535&\"・\"&L535&\"・\"&M535,I535&\"・\"&J535&\"・\"&K535&\"・\"&L535&\"・\"&M535&\"・\"&N535))))))","v":""},"","","","",""]
[null,{"$f":"データリスト!AF$46","v":"政治関連活動"},{"$f":"IF(データリスト!$AF54=\"\",\"\",データリスト!$AF54)","v":"期日前投票のお願い"},{"$nulls":17},{"$f":"IF(I536:N536=\"\",\"\",IF(J536:N536=\"\",I536,IF(K536:N536=\"\",I536&\"・\"&J536,IF(L536:N536=\"\",I536&\"・\"&J536&\"・\"&K536,IF(M536:N536=\"\",I536&\"・\"&J536&\"・\"&K536&\"・\"&L536,IF(N536=\"\",I536&\"・\"&J536&\"・\"&K536&\"・\"&L536&\"・\"&M536,I536&\"・\"&J536&\"・\"&K536&\"・\"&L536&\"・\"&M536&\"・\"&N536))))))","v":""},"","","","",""]
[null,{"$f":"データリスト!AF$46","v":"政治関連活動"},{"$f":"IF(データリスト!$AF55=\"\",\"\",データリスト!$AF55)","v":"遊説打ち上げ"},{"$nulls":17},{"$f":"IF(I537:N537=\"\",\"\",IF(J537:N537=\"\",I537,IF(K537:N537=\"\",I537&\"・\"&J537,IF(L537:N537=\"\",I537&\"・\"&J537&\"・\"&K537,IF(M537:N537=\"\",I537&\"・\"&J537&\"・\"&K537&\"・\"&L537,IF(N537=\"\",I537&\"・\"&J537&\"・\"&K537&\"・\"&L537&\"・\"&M537,I537&\"・\"&J537&\"・\"&K537&\"・\"&L537&\"・\"&M537&\"・\"&N537))))))","v":""},"","","","",""]
[null,{"$f":"データリスト!AF$46","v":"政治関連活動"},{"$f":"IF(データリスト!$AF56=\"\",\"\",データリスト!$AF56)","v":"投票確認・報告"},{"$nulls":17},{"$f":"IF(I538:N538=\"\",\"\",IF(J538:N538=\"\",I538,IF(K538:N538=\"\",I538&\"・\"&J538,IF(L538:N538=\"\",I538&\"・\"&J538&\"・\"&K538,IF(M538:N538=\"\",I538&\"・\"&J538&\"・\"&K538&\"・\"&L538,IF(N538=\"\",I538&\"・\"&J538&\"・\"&K538&\"・\"&L538&\"・\"&M538,I538&\"・\"&J538&\"・\"&K538&\"・\"&L538&\"・\"&M538&\"・\"&N538))))))","v":""},"","","","",""]
[null,{"$f":"データリスト!AF$46","v":"政治関連活動"},{"$f":"IF(データリスト!$AF57=\"\",\"\",データリスト!$AF57)","v":""},{"$nulls":17},{"$f":"IF(I539:N539=\"\",\"\",IF(J539:N539=\"\",I539,IF(K539:N539=\"\",I539&\"・\"&J539,IF(L539:N539=\"\",I539&\"・\"&J539&\"・\"&K539,IF(M539:N539=\"\",I539&\"・\"&J539&\"・\"&K539&\"・\"&L539,IF(N539=\"\",I539&\"・\"&J539&\"・\"&K539&\"・\"&L539&\"・\"&M539,I539&\"・\"&J539&\"・\"&K539&\"・\"&L539&\"・\"&M539&\"・\"&N539))))))","v":""},"","","","",""]
[null,{"$f":"データリスト!AF$46","v":"政治関連活動"},{"$f":"IF(データリスト!$AF58=\"\",\"\",データリスト!$AF58)","v":""},{"$nulls":17},{"$f":"IF(I540:N540=\"\",\"\",IF(J540:N540=\"\",I540,IF(K540:N540=\"\",I540&\"・\"&J540,IF(L540:N540=\"\",I540&\"・\"&J540&\"・\"&K540,IF(M540:N540=\"\",I540&\"・\"&J540&\"・\"&K540&\"・\"&L540,IF(N540=\"\",I540&\"・\"&J540&\"・\"&K540&\"・\"&L540&\"・\"&M540,I540&\"・\"&J540&\"・\"&K540&\"・\"&L540&\"・\"&M540&\"・\"&N540))))))","v":""},"","","","",""]
[null,{"$f":"データリスト!AF$46","v":"政治関連活動"},{"$f":"IF(データリスト!$AF59=\"\",\"\",データリスト!$AF59)","v":""},{"$nulls":17},{"$f":"IF(I541:N541=\"\",\"\",IF(J541:N541=\"\",I541,IF(K541:N541=\"\",I541&\"・\"&J541,IF(L541:N541=\"\",I541&\"・\"&J541&\"・\"&K541,IF(M541:N541=\"\",I541&\"・\"&J541&\"・\"&K541&\"・\"&L541,IF(N541=\"\",I541&\"・\"&J541&\"・\"&K541&\"・\"&L541&\"・\"&M541,I541&\"・\"&J541&\"・\"&K541&\"・\"&L541&\"・\"&M541&\"・\"&N541))))))","v":""},"","","","",""]
[null,{"$f":"データリスト!AF$46","v":"政治関連活動"},{"$f":"IF(データリスト!$AF60=\"\",\"\",データリスト!$AF60)","v":""},{"$nulls":17},{"$f":"IF(I542:N542=\"\",\"\",IF(J542:N542=\"\",I542,IF(K542:N542=\"\",I542&\"・\"&J542,IF(L542:N542=\"\",I542&\"・\"&J542&\"・\"&K542,IF(M542:N542=\"\",I542&\"・\"&J542&\"・\"&K542&\"・\"&L542,IF(N542=\"\",I542&\"・\"&J542&\"・\"&K542&\"・\"&L542&\"・\"&M542,I542&\"・\"&J542&\"・\"&K542&\"・\"&L542&\"・\"&M542&\"・\"&N542))))))","v":""},"","","","",""]
[null,{"$f":"データリスト!AF$46","v":"政治関連活動"},{"$f":"IF(データリスト!$AF61=\"\",\"\",データリスト!$AF61)","v":""},{"$nulls":17},{"$f":"IF(I543:N543=\"\",\"\",IF(J543:N543=\"\",I543,IF(K543:N543=\"\",I543&\"・\"&J543,IF(L543:N543=\"\",I543&\"・\"&J543&\"・\"&K543,IF(M543:N543=\"\",I543&\"・\"&J543&\"・\"&K543&\"・\"&L543,IF(N543=\"\",I543&\"・\"&J543&\"・\"&K543&\"・\"&L543&\"・\"&M543,I543&\"・\"&J543&\"・\"&K543&\"・\"&L543&\"・\"&M543&\"・\"&N543))))))","v":""},"","","","",""]
[null,{"$f":"データリスト!AF$46","v":"政治関連活動"},{"$f":"IF(データリスト!$AF62=\"\",\"\",データリスト!$AF62)","v":""},{"$nulls":17},{"$f":"IF(I544:N544=\"\",\"\",IF(J544:N544=\"\",I544,IF(K544:N544=\"\",I544&\"・\"&J544,IF(L544:N544=\"\",I544&\"・\"&J544&\"・\"&K544,IF(M544:N544=\"\",I544&\"・\"&J544&\"・\"&K544&\"・\"&L544,IF(N544=\"\",I544&\"・\"&J544&\"・\"&K544&\"・\"&L544&\"・\"&M544,I544&\"・\"&J544&\"・\"&K544&\"・\"&L544&\"・\"&M544&\"・\"&N544))))))","v":""},"","","","",""]
[null,{"$f":"データリスト!AF$46","v":"政治関連活動"},{"$f":"IF(データリスト!$AF63=\"\",\"\",データリスト!$AF63)","v":""},{"$nulls":17},{"$f":"IF(I545:N545=\"\",\"\",IF(J545:N545=\"\",I545,IF(K545:N545=\"\",I545&\"・\"&J545,IF(L545:N545=\"\",I545&\"・\"&J545&\"・\"&K545,IF(M545:N545=\"\",I545&\"・\"&J545&\"・\"&K545&\"・\"&L545,IF(N545=\"\",I545&\"・\"&J545&\"・\"&K545&\"・\"&L545&\"・\"&M545,I545&\"・\"&J545&\"・\"&K545&\"・\"&L545&\"・\"&M545&\"・\"&N545))))))","v":""},"","","","",""]
[null,{"$f":"データリスト!AF$46","v":"政治関連活動"},{"$f":"IF(データリスト!$AF64=\"\",\"\",データリスト!$AF64)","v":""},{"$nulls":17},{"$f":"IF(I546:N546=\"\",\"\",IF(J546:N546=\"\",I546,IF(K546:N546=\"\",I546&\"・\"&J546,IF(L546:N546=\"\",I546&\"・\"&J546&\"・\"&K546,IF(M546:N546=\"\",I546&\"・\"&J546&\"・\"&K546&\"・\"&L546,IF(N546=\"\",I546&\"・\"&J546&\"・\"&K546&\"・\"&L546&\"・\"&M546,I546&\"・\"&J546&\"・\"&K546&\"・\"&L546&\"・\"&M546&\"・\"&N546))))))","v":""},"","","","",""]
[null,{"$f":"データリスト!AF$46","v":"政治関連活動"},{"$f":"IF(データリスト!$AF65=\"\",\"\",データリスト!$AF65)","v":""},{"$nulls":17},{"$f":"IF(I547:N547=\"\",\"\",IF(J547:N547=\"\",I547,IF(K547:N547=\"\",I547&\"・\"&J547,IF(L547:N547=\"\",I547&\"・\"&J547&\"・\"&K547,IF(M547:N547=\"\",I547&\"・\"&J547&\"・\"&K547&\"・\"&L547,IF(N547=\"\",I547&\"・\"&J547&\"・\"&K547&\"・\"&L547&\"・\"&M547,I547&\"・\"&J547&\"・\"&K547&\"・\"&L547&\"・\"&M547&\"・\"&N547))))))","v":""},"","","","",""]
[null,{"$f":"データリスト!AF$46","v":"政治関連活動"},{"$f":"IF(データリスト!$AF66=\"\",\"\",データリスト!$AF66)","v":""},{"$nulls":17},{"$f":"IF(I548:N548=\"\",\"\",IF(J548:N548=\"\",I548,IF(K548:N548=\"\",I548&\"・\"&J548,IF(L548:N548=\"\",I548&\"・\"&J548&\"・\"&K548,IF(M548:N548=\"\",I548&\"・\"&J548&\"・\"&K548&\"・\"&L548,IF(N548=\"\",I548&\"・\"&J548&\"・\"&K548&\"・\"&L548&\"・\"&M548,I548&\"・\"&J548&\"・\"&K548&\"・\"&L548&\"・\"&M548&\"・\"&N548))))))","v":""},"","","","",""]
[null,{"$f":"データリスト!AG$46","v":"電力生協"},{"$f":"IF(データリスト!$AG47=\"\",\"\",データリスト!$AG47)","v":"募集周知"},{"$nulls":17},{"$f":"IF(I549:N549=\"\",\"\",IF(J549:N549=\"\",I549,IF(K549:N549=\"\",I549&\"・\"&J549,IF(L549:N549=\"\",I549&\"・\"&J549&\"・\"&K549,IF(M549:N549=\"\",I549&\"・\"&J549&\"・\"&K549&\"・\"&L549,IF(N549=\"\",I549&\"・\"&J549&\"・\"&K549&\"・\"&L549&\"・\"&M549,I549&\"・\"&J549&\"・\"&K549&\"・\"&L549&\"・\"&M549&\"・\"&N549))))))","v":""},"","","","",""]
[null,{"$f":"データリスト!AG$46","v":"電力生協"},{"$f":"IF(データリスト!$AG48=\"\",\"\",データリスト!$AG48)","v":"資料・申込書配布"},{"$nulls":17},{"$f":"IF(I550:N550=\"\",\"\",IF(J550:N550=\"\",I550,IF(K550:N550=\"\",I550&\"・\"&J550,IF(L550:N550=\"\",I550&\"・\"&J550&\"・\"&K550,IF(M550:N550=\"\",I550&\"・\"&J550&\"・\"&K550&\"・\"&L550,IF(N550=\"\",I550&\"・\"&J550&\"・\"&K550&\"・\"&L550&\"・\"&M550,I550&\"・\"&J550&\"・\"&K550&\"・\"&L550&\"・\"&M550&\"・\"&N550))))))","v":""},"","","","",""]
[null,{"$f":"データリスト!AG$46","v":"電力生協"},{"$f":"IF(データリスト!$AG49=\"\",\"\",データリスト!$AG49)","v":"東日本興業との日程調整"},{"$nulls":17},{"$f":"IF(I551:N551=\"\",\"\",IF(J551:N551=\"\",I551,IF(K551:N551=\"\",I551&\"・\"&J551,IF(L551:N551=\"\",I551&\"・\"&J551&\"・\"&K551,IF(M551:N551=\"\",I551&\"・\"&J551&\"・\"&K551&\"・\"&L551,IF(N551=\"\",I551&\"・\"&J551&\"・\"&K551&\"・\"&L551&\"・\"&M551,I551&\"・\"&J551&\"・\"&K551&\"・\"&L551&\"・\"&M551&\"・\"&N551))))))","v":""},"","","","",""]
[null,{"$f":"データリスト!AG$46","v":"電力生協"},{"$f":"IF(データリスト!$AG50=\"\",\"\",データリスト!$AG50)","v":"職場周知・申込書の配布"},{"$nulls":17},{"$f":"IF(I552:N552=\"\",\"\",IF(J552:N552=\"\",I552,IF(K552:N552=\"\",I552&\"・\"&J552,IF(L552:N552=\"\",I552&\"・\"&J552&\"・\"&K552,IF(M552:N552=\"\",I552&\"・\"&J552&\"・\"&K552&\"・\"&L552,IF(N552=\"\",I552&\"・\"&J552&\"・\"&K552&\"・\"&L552&\"・\"&M552,I552&\"・\"&J552&\"・\"&K552&\"・\"&L552&\"・\"&M552&\"・\"&N552))))))","v":""},"","","","",""]
[null,{"$f":"データリスト!AG$46","v":"電力生協"},{"$f":"IF(データリスト!$AG51=\"\",\"\",データリスト!$AG51)","v":"会場調整"},{"$nulls":17},{"$f":"IF(I553:N553=\"\",\"\",IF(J553:N553=\"\",I553,IF(K553:N553=\"\",I553&\"・\"&J553,IF(L553:N553=\"\",I553&\"・\"&J553&\"・\"&K553,IF(M553:N553=\"\",I553&\"・\"&J553&\"・\"&K553&\"・\"&L553,IF(N553=\"\",I553&\"・\"&J553&\"・\"&K553&\"・\"&L553&\"・\"&M553,I553&\"・\"&J553&\"・\"&K553&\"・\"&L553&\"・\"&M553&\"・\"&N553))))))","v":""},"","","","",""]
[null,{"$f":"データリスト!AG$46","v":"電力生協"},{"$f":"IF(データリスト!$AG52=\"\",\"\",データリスト!$AG52)","v":"会場準備"},{"$nulls":17},{"$f":"IF(I554:N554=\"\",\"\",IF(J554:N554=\"\",I554,IF(K554:N554=\"\",I554&\"・\"&J554,IF(L554:N554=\"\",I554&\"・\"&J554&\"・\"&K554,IF(M554:N554=\"\",I554&\"・\"&J554&\"・\"&K554&\"・\"&L554,IF(N554=\"\",I554&\"・\"&J554&\"・\"&K554&\"・\"&L554&\"・\"&M554,I554&\"・\"&J554&\"・\"&K554&\"・\"&L554&\"・\"&M554&\"・\"&N554))))))","v":""},"","","","",""]
[null,{"$f":"データリスト!AG$46","v":"電力生協"},{"$f":"IF(データリスト!$AG53=\"\",\"\",データリスト!$AG53)","v":"説明会司会"},{"$nulls":17},{"$f":"IF(I555:N555=\"\",\"\",IF(J555:N555=\"\",I555,IF(K555:N555=\"\",I555&\"・\"&J555,IF(L555:N555=\"\",I555&\"・\"&J555&\"・\"&K555,IF(M555:N555=\"\",I555&\"・\"&J555&\"・\"&K555&\"・\"&L555,IF(N555=\"\",I555&\"・\"&J555&\"・\"&K555&\"・\"&L555&\"・\"&M555,I555&\"・\"&J555&\"・\"&K555&\"・\"&L555&\"・\"&M555&\"・\"&N555))))))","v":""},"","","","",""]
[null,{"$f":"データリスト!AG$46","v":"電力生協"},{"$f":"IF(データリスト!$AG54=\"\",\"\",データリスト!$AG54)","v":"会場片付け"},{"$nulls":17},{"$f":"IF(I556:N556=\"\",\"\",IF(J556:N556=\"\",I556,IF(K556:N556=\"\",I556&\"・\"&J556,IF(L556:N556=\"\",I556&\"・\"&J556&\"・\"&K556,IF(M556:N556=\"\",I556&\"・\"&J556&\"・\"&K556&\"・\"&L556,IF(N556=\"\",I556&\"・\"&J556&\"・\"&K556&\"・\"&L556&\"・\"&M556,I556&\"・\"&J556&\"・\"&K556&\"・\"&L556&\"・\"&M556&\"・\"&N556))))))","v":""},"","","","",""]
[null,{"$f":"データリスト!AG$46","v":"電力生協"},{"$f":"IF(データリスト!$AG55=\"\",\"\",データリスト!$AG55)","v":"申込書回収"},{"$nulls":17},{"$f":"IF(I557:N557=\"\",\"\",IF(J557:N557=\"\",I557,IF(K557:N557=\"\",I557&\"・\"&J557,IF(L557:N557=\"\",I557&\"・\"&J557&\"・\"&K557,IF(M557:N557=\"\",I557&\"・\"&J557&\"・\"&K557&\"・\"&L557,IF(N557=\"\",I557&\"・\"&J557&\"・\"&K557&\"・\"&L557&\"・\"&M557,I557&\"・\"&J557&\"・\"&K557&\"・\"&L557&\"・\"&M557&\"・\"&N557))))))","v":""},"","","","",""]
[null,{"$f":"データリスト!AG$46","v":"電力生協"},{"$f":"IF(データリスト!$AG56=\"\",\"\",データリスト!$AG56)","v":"申込書の記載内容の確認"},{"$nulls":17},{"$f":"IF(I558:N558=\"\",\"\",IF(J558:N558=\"\",I558,IF(K558:N558=\"\",I558&\"・\"&J558,IF(L558:N558=\"\",I558&\"・\"&J558&\"・\"&K558,IF(M558:N558=\"\",I558&\"・\"&J558&\"・\"&K558&\"・\"&L558,IF(N558=\"\",I558&\"・\"&J558&\"・\"&K558&\"・\"&L558&\"・\"&M558,I558&\"・\"&J558&\"・\"&K558&\"・\"&L558&\"・\"&M558&\"・\"&N558))))))","v":""},"","","","",""]
[null,{"$f":"データリスト!AG$46","v":"電力生協"},{"$f":"IF(データリスト!$AG57=\"\",\"\",データリスト!$AG57)","v":"申込書の送付"},{"$nulls":17},{"$f":"IF(I559:N559=\"\",\"\",IF(J559:N559=\"\",I559,IF(K559:N559=\"\",I559&\"・\"&J559,IF(L559:N559=\"\",I559&\"・\"&J559&\"・\"&K559,IF(M559:N559=\"\",I559&\"・\"&J559&\"・\"&K559&\"・\"&L559,IF(N559=\"\",I559&\"・\"&J559&\"・\"&K559&\"・\"&L559&\"・\"&M559,I559&\"・\"&J559&\"・\"&K559&\"・\"&L559&\"・\"&M559&\"・\"&N559))))))","v":""},"","","","",""]
[null,{"$f":"データリスト!AG$46","v":"電力生協"},{"$f":"IF(データリスト!$AG58=\"\",\"\",データリスト!$AG58)","v":"対外窓口"},{"$nulls":17},{"$f":"IF(I560:N560=\"\",\"\",IF(J560:N560=\"\",I560,IF(K560:N560=\"\",I560&\"・\"&J560,IF(L560:N560=\"\",I560&\"・\"&J560&\"・\"&K560,IF(M560:N560=\"\",I560&\"・\"&J560&\"・\"&K560&\"・\"&L560,IF(N560=\"\",I560&\"・\"&J560&\"・\"&K560&\"・\"&L560&\"・\"&M560,I560&\"・\"&J560&\"・\"&K560&\"・\"&L560&\"・\"&M560&\"・\"&N560))))))","v":""},"","","","",""]
[null,{"$f":"データリスト!AG$46","v":"電力生協"},{"$f":"IF(データリスト!$AG59=\"\",\"\",データリスト!$AG59)","v":"所内窓口"},{"$nulls":17},{"$f":"IF(I561:N561=\"\",\"\",IF(J561:N561=\"\",I561,IF(K561:N561=\"\",I561&\"・\"&J561,IF(L561:N561=\"\",I561&\"・\"&J561&\"・\"&K561,IF(M561:N561=\"\",I561&\"・\"&J561&\"・\"&K561&\"・\"&L561,IF(N561=\"\",I561&\"・\"&J561&\"・\"&K561&\"・\"&L561&\"・\"&M561,I561&\"・\"&J561&\"・\"&K561&\"・\"&L561&\"・\"&M561&\"・\"&N561))))))","v":""},"","","","",""]
[null,{"$f":"データリスト!AG$46","v":"電力生協"},{"$f":"IF(データリスト!$AG60=\"\",\"\",データリスト!$AG60)","v":"書類の管理・手配"},{"$nulls":17},{"$f":"IF(I562:N562=\"\",\"\",IF(J562:N562=\"\",I562,IF(K562:N562=\"\",I562&\"・\"&J562,IF(L562:N562=\"\",I562&\"・\"&J562&\"・\"&K562,IF(M562:N562=\"\",I562&\"・\"&J562&\"・\"&K562&\"・\"&L562,IF(N562=\"\",I562&\"・\"&J562&\"・\"&K562&\"・\"&L562&\"・\"&M562,I562&\"・\"&J562&\"・\"&K562&\"・\"&L562&\"・\"&M562&\"・\"&N562))))))","v":""},"","","","",""]
[null,{"$f":"データリスト!AG$46","v":"電力生協"},{"$f":"IF(データリスト!$AG61=\"\",\"\",データリスト!$AG61)","v":"提出書類の確認"},{"$nulls":17},{"$f":"IF(I563:N563=\"\",\"\",IF(J563:N563=\"\",I563,IF(K563:N563=\"\",I563&\"・\"&J563,IF(L563:N563=\"\",I563&\"・\"&J563&\"・\"&K563,IF(M563:N563=\"\",I563&\"・\"&J563&\"・\"&K563&\"・\"&L563,IF(N563=\"\",I563&\"・\"&J563&\"・\"&K563&\"・\"&L563&\"・\"&M563,I563&\"・\"&J563&\"・\"&K563&\"・\"&L563&\"・\"&M563&\"・\"&N563))))))","v":""},"","","","",""]
[null,{"$f":"データリスト!AG$46","v":"電力生協"},{"$f":"IF(データリスト!$AG62=\"\",\"\",データリスト!$AG62)","v":"書類の送付"},{"$nulls":17},{"$f":"IF(I564:N564=\"\",\"\",IF(J564:N564=\"\",I564,IF(K564:N564=\"\",I564&\"・\"&J564,IF(L564:N564=\"\",I564&\"・\"&J564&\"・\"&K564,IF(M564:N564=\"\",I564&\"・\"&J564&\"・\"&K564&\"・\"&L564,IF(N564=\"\",I564&\"・\"&J564&\"・\"&K564&\"・\"&L564&\"・\"&M564,I564&\"・\"&J564&\"・\"&K564&\"・\"&L564&\"・\"&M564&\"・\"&N564))))))","v":""},"","","","",""]
[null,{"$f":"データリスト!AG$46","v":"電力生協"},{"$f":"IF(データリスト!$AG63=\"\",\"\",データリスト!$AG63)","v":""},{"$nulls":17},{"$f":"IF(I565:N565=\"\",\"\",IF(J565:N565=\"\",I565,IF(K565:N565=\"\",I565&\"・\"&J565,IF(L565:N565=\"\",I565&\"・\"&J565&\"・\"&K565,IF(M565:N565=\"\",I565&\"・\"&J565&\"・\"&K565&\"・\"&L565,IF(N565=\"\",I565&\"・\"&J565&\"・\"&K565&\"・\"&L565&\"・\"&M565,I565&\"・\"&J565&\"・\"&K565&\"・\"&L565&\"・\"&M565&\"・\"&N565))))))","v":""},"","","","",""]
[null,{"$f":"データリスト!AG$46","v":"電力生協"},{"$f":"IF(データリスト!$AG64=\"\",\"\",データリスト!$AG64)","v":""},{"$nulls":17},{"$f":"IF(I566:N566=\"\",\"\",IF(J566:N566=\"\",I566,IF(K566:N566=\"\",I566&\"・\"&J566,IF(L566:N566=\"\",I566&\"・\"&J566&\"・\"&K566,IF(M566:N566=\"\",I566&\"・\"&J566&\"・\"&K566&\"・\"&L566,IF(N566=\"\",I566&\"・\"&J566&\"・\"&K566&\"・\"&L566&\"・\"&M566,I566&\"・\"&J566&\"・\"&K566&\"・\"&L566&\"・\"&M566&\"・\"&N566))))))","v":""},"","","","",""]
[null,{"$f":"データリスト!AG$46","v":"電力生協"},{"$f":"IF(データリスト!$AG65=\"\",\"\",データリスト!$AG65)","v":""},{"$nulls":17},{"$f":"IF(I567:N567=\"\",\"\",IF(J567:N567=\"\",I567,IF(K567:N567=\"\",I567&\"・\"&J567,IF(L567:N567=\"\",I567&\"・\"&J567&\"・\"&K567,IF(M567:N567=\"\",I567&\"・\"&J567&\"・\"&K567&\"・\"&L567,IF(N567=\"\",I567&\"・\"&J567&\"・\"&K567&\"・\"&L567&\"・\"&M567,I567&\"・\"&J567&\"・\"&K567&\"・\"&L567&\"・\"&M567&\"・\"&N567))))))","v":""},"","","","",""]
[null,{"$f":"データリスト!AG$46","v":"電力生協"},{"$f":"IF(データリスト!$AG66=\"\",\"\",データリスト!$AG66)","v":""},{"$nulls":17},{"$f":"IF(I568:N568=\"\",\"\",IF(J568:N568=\"\",I568,IF(K568:N568=\"\",I568&\"・\"&J568,IF(L568:N568=\"\",I568&\"・\"&J568&\"・\"&K568,IF(M568:N568=\"\",I568&\"・\"&J568&\"・\"&K568&\"・\"&L568,IF(N568=\"\",I568&\"・\"&J568&\"・\"&K568&\"・\"&L568&\"・\"&M568,I568&\"・\"&J568&\"・\"&K568&\"・\"&L568&\"・\"&M568&\"・\"&N568))))))","v":""},"","","","",""]
[null,{"$f":"データリスト!AH$46","v":"電力年金"},{"$f":"IF(データリスト!$AH47=\"\",\"\",データリスト!$AH47)","v":"職場周知"},{"$nulls":17},{"$f":"IF(I569:N569=\"\",\"\",IF(J569:N569=\"\",I569,IF(K569:N569=\"\",I569&\"・\"&J569,IF(L569:N569=\"\",I569&\"・\"&J569&\"・\"&K569,IF(M569:N569=\"\",I569&\"・\"&J569&\"・\"&K569&\"・\"&L569,IF(N569=\"\",I569&\"・\"&J569&\"・\"&K569&\"・\"&L569&\"・\"&M569,I569&\"・\"&J569&\"・\"&K569&\"・\"&L569&\"・\"&M569&\"・\"&N569))))))","v":""},"","","","",""]
[null,{"$f":"データリスト!AH$46","v":"電力年金"},{"$f":"IF(データリスト!$AH48=\"\",\"\",データリスト!$AH48)","v":"資料・申込書配布"},{"$nulls":17},{"$f":"IF(I570:N570=\"\",\"\",IF(J570:N570=\"\",I570,IF(K570:N570=\"\",I570&\"・\"&J570,IF(L570:N570=\"\",I570&\"・\"&J570&\"・\"&K570,IF(M570:N570=\"\",I570&\"・\"&J570&\"・\"&K570&\"・\"&L570,IF(N570=\"\",I570&\"・\"&J570&\"・\"&K570&\"・\"&L570&\"・\"&M570,I570&\"・\"&J570&\"・\"&K570&\"・\"&L570&\"・\"&M570&\"・\"&N570))))))","v":""},"","","","",""]
[null,{"$f":"データリスト!AH$46","v":"電力年金"},{"$f":"IF(データリスト!$AH49=\"\",\"\",データリスト!$AH49)","v":"不足書類の手配"},{"$nulls":17},{"$f":"IF(I571:N571=\"\",\"\",IF(J571:N571=\"\",I571,IF(K571:N571=\"\",I571&\"・\"&J571,IF(L571:N571=\"\",I571&\"・\"&J571&\"・\"&K571,IF(M571:N571=\"\",I571&\"・\"&J571&\"・\"&K571&\"・\"&L571,IF(N571=\"\",I571&\"・\"&J571&\"・\"&K571&\"・\"&L571&\"・\"&M571,I571&\"・\"&J571&\"・\"&K571&\"・\"&L571&\"・\"&M571&\"・\"&N571))))))","v":""},"","","","",""]
[null,{"$f":"データリスト!AH$46","v":"電力年金"},{"$f":"IF(データリスト!$AH50=\"\",\"\",データリスト!$AH50)","v":"申込書回収"},{"$nulls":17},{"$f":"IF(I572:N572=\"\",\"\",IF(J572:N572=\"\",I572,IF(K572:N572=\"\",I572&\"・\"&J572,IF(L572:N572=\"\",I572&\"・\"&J572&\"・\"&K572,IF(M572:N572=\"\",I572&\"・\"&J572&\"・\"&K572&\"・\"&L572,IF(N572=\"\",I572&\"・\"&J572&\"・\"&K572&\"・\"&L572&\"・\"&M572,I572&\"・\"&J572&\"・\"&K572&\"・\"&L572&\"・\"&M572&\"・\"&N572))))))","v":""},"","","","",""]
[null,{"$f":"データリスト!AH$46","v":"電力年金"},{"$f":"IF(データリスト!$AH51=\"\",\"\",データリスト!$AH51)","v":"申込書の記載内容の確認"},{"$nulls":17},{"$f":"IF(I573:N573=\"\",\"\",IF(J573:N573=\"\",I573,IF(K573:N573=\"\",I573&\"・\"&J573,IF(L573:N573=\"\",I573&\"・\"&J573&\"・\"&K573,IF(M573:N573=\"\",I573&\"・\"&J573&\"・\"&K573&\"・\"&L573,IF(N573=\"\",I573&\"・\"&J573&\"・\"&K573&\"・\"&L573&\"・\"&M573,I573&\"・\"&J573&\"・\"&K573&\"・\"&L573&\"・\"&M573&\"・\"&N573))))))","v":""},"","","","",""]
[null,{"$f":"データリスト!AH$46","v":"電力年金"},{"$f":"IF(データリスト!$AH52=\"\",\"\",データリスト!$AH52)","v":"書類の送付"},{"$nulls":17},{"$f":"IF(I574:N574=\"\",\"\",IF(J574:N574=\"\",I574,IF(K574:N574=\"\",I574&\"・\"&J574,IF(L574:N574=\"\",I574&\"・\"&J574&\"・\"&K574,IF(M574:N574=\"\",I574&\"・\"&J574&\"・\"&K574&\"・\"&L574,IF(N574=\"\",I574&\"・\"&J574&\"・\"&K574&\"・\"&L574&\"・\"&M574,I574&\"・\"&J574&\"・\"&K574&\"・\"&L574&\"・\"&M574&\"・\"&N574))))))","v":""},"","","","",""]
[null,{"$f":"データリスト!AH$46","v":"電力年金"},{"$f":"IF(データリスト!$AH53=\"\",\"\",データリスト!$AH53)","v":""},{"$nulls":17},{"$f":"IF(I575:N575=\"\",\"\",IF(J575:N575=\"\",I575,IF(K575:N575=\"\",I575&\"・\"&J575,IF(L575:N575=\"\",I575&\"・\"&J575&\"・\"&K575,IF(M575:N575=\"\",I575&\"・\"&J575&\"・\"&K575&\"・\"&L575,IF(N575=\"\",I575&\"・\"&J575&\"・\"&K575&\"・\"&L575&\"・\"&M575,I575&\"・\"&J575&\"・\"&K575&\"・\"&L575&\"・\"&M575&\"・\"&N575))))))","v":""},"","","","",""]
[null,{"$f":"データリスト!AH$46","v":"電力年金"},{"$f":"IF(データリスト!$AH54=\"\",\"\",データリスト!$AH54)","v":""},{"$nulls":17},{"$f":"IF(I576:N576=\"\",\"\",IF(J576:N576=\"\",I576,IF(K576:N576=\"\",I576&\"・\"&J576,IF(L576:N576=\"\",I576&\"・\"&J576&\"・\"&K576,IF(M576:N576=\"\",I576&\"・\"&J576&\"・\"&K576&\"・\"&L576,IF(N576=\"\",I576&\"・\"&J576&\"・\"&K576&\"・\"&L576&\"・\"&M576,I576&\"・\"&J576&\"・\"&K576&\"・\"&L576&\"・\"&M576&\"・\"&N576))))))","v":""},"","","","",""]
[null,{"$f":"データリスト!AH$46","v":"電力年金"},{"$f":"IF(データリスト!$AH55=\"\",\"\",データリスト!$AH55)","v":""},{"$nulls":17},{"$f":"IF(I577:N577=\"\",\"\",IF(J577:N577=\"\",I577,IF(K577:N577=\"\",I577&\"・\"&J577,IF(L577:N577=\"\",I577&\"・\"&J577&\"・\"&K577,IF(M577:N577=\"\",I577&\"・\"&J577&\"・\"&K577&\"・\"&L577,IF(N577=\"\",I577&\"・\"&J577&\"・\"&K577&\"・\"&L577&\"・\"&M577,I577&\"・\"&J577&\"・\"&K577&\"・\"&L577&\"・\"&M577&\"・\"&N577))))))","v":""},"","","","",""]
[null,{"$f":"データリスト!AH$46","v":"電力年金"},{"$f":"IF(データリスト!$AH56=\"\",\"\",データリスト!$AH56)","v":""},{"$nulls":17},{"$f":"IF(I578:N578=\"\",\"\",IF(J578:N578=\"\",I578,IF(K578:N578=\"\",I578&\"・\"&J578,IF(L578:N578=\"\",I578&\"・\"&J578&\"・\"&K578,IF(M578:N578=\"\",I578&\"・\"&J578&\"・\"&K578&\"・\"&L578,IF(N578=\"\",I578&\"・\"&J578&\"・\"&K578&\"・\"&L578&\"・\"&M578,I578&\"・\"&J578&\"・\"&K578&\"・\"&L578&\"・\"&M578&\"・\"&N578))))))","v":""},"","","","",""]
[null,{"$f":"データリスト!AH$46","v":"電力年金"},{"$f":"IF(データリスト!$AH57=\"\",\"\",データリスト!$AH57)","v":""},{"$nulls":17},{"$f":"IF(I579:N579=\"\",\"\",IF(J579:N579=\"\",I579,IF(K579:N579=\"\",I579&\"・\"&J579,IF(L579:N579=\"\",I579&\"・\"&J579&\"・\"&K579,IF(M579:N579=\"\",I579&\"・\"&J579&\"・\"&K579&\"・\"&L579,IF(N579=\"\",I579&\"・\"&J579&\"・\"&K579&\"・\"&L579&\"・\"&M579,I579&\"・\"&J579&\"・\"&K579&\"・\"&L579&\"・\"&M579&\"・\"&N579))))))","v":""},"","","","",""]
[null,{"$f":"データリスト!AH$46","v":"電力年金"},{"$f":"IF(データリスト!$AH58=\"\",\"\",データリスト!$AH58)","v":""},{"$nulls":17},{"$f":"IF(I580:N580=\"\",\"\",IF(J580:N580=\"\",I580,IF(K580:N580=\"\",I580&\"・\"&J580,IF(L580:N580=\"\",I580&\"・\"&J580&\"・\"&K580,IF(M580:N580=\"\",I580&\"・\"&J580&\"・\"&K580&\"・\"&L580,IF(N580=\"\",I580&\"・\"&J580&\"・\"&K580&\"・\"&L580&\"・\"&M580,I580&\"・\"&J580&\"・\"&K580&\"・\"&L580&\"・\"&M580&\"・\"&N580))))))","v":""},"","","","",""]
[null,{"$f":"データリスト!AH$46","v":"電力年金"},{"$f":"IF(データリスト!$AH59=\"\",\"\",データリスト!$AH59)","v":""},{"$nulls":17},{"$f":"IF(I581:N581=\"\",\"\",IF(J581:N581=\"\",I581,IF(K581:N581=\"\",I581&\"・\"&J581,IF(L581:N581=\"\",I581&\"・\"&J581&\"・\"&K581,IF(M581:N581=\"\",I581&\"・\"&J581&\"・\"&K581&\"・\"&L581,IF(N581=\"\",I581&\"・\"&J581&\"・\"&K581&\"・\"&L581&\"・\"&M581,I581&\"・\"&J581&\"・\"&K581&\"・\"&L581&\"・\"&M581&\"・\"&N581))))))","v":""},"","","","",""]
[null,{"$f":"データリスト!AH$46","v":"電力年金"},{"$f":"IF(データリスト!$AH60=\"\",\"\",データリスト!$AH60)","v":""},{"$nulls":17},{"$f":"IF(I582:N582=\"\",\"\",IF(J582:N582=\"\",I582,IF(K582:N582=\"\",I582&\"・\"&J582,IF(L582:N582=\"\",I582&\"・\"&J582&\"・\"&K582,IF(M582:N582=\"\",I582&\"・\"&J582&\"・\"&K582&\"・\"&L582,IF(N582=\"\",I582&\"・\"&J582&\"・\"&K582&\"・\"&L582&\"・\"&M582,I582&\"・\"&J582&\"・\"&K582&\"・\"&L582&\"・\"&M582&\"・\"&N582))))))","v":""},"","","","",""]
[null,{"$f":"データリスト!AH$46","v":"電力年金"},{"$f":"IF(データリスト!$AH61=\"\",\"\",データリスト!$AH61)","v":""},{"$nulls":17},{"$f":"IF(I583:N583=\"\",\"\",IF(J583:N583=\"\",I583,IF(K583:N583=\"\",I583&\"・\"&J583,IF(L583:N583=\"\",I583&\"・\"&J583&\"・\"&K583,IF(M583:N583=\"\",I583&\"・\"&J583&\"・\"&K583&\"・\"&L583,IF(N583=\"\",I583&\"・\"&J583&\"・\"&K583&\"・\"&L583&\"・\"&M583,I583&\"・\"&J583&\"・\"&K583&\"・\"&L583&\"・\"&M583&\"・\"&N583))))))","v":""},"","","","",""]
[null,{"$f":"データリスト!AH$46","v":"電力年金"},{"$f":"IF(データリスト!$AH62=\"\",\"\",データリスト!$AH62)","v":""},{"$nulls":17},{"$f":"IF(I584:N584=\"\",\"\",IF(J584:N584=\"\",I584,IF(K584:N584=\"\",I584&\"・\"&J584,IF(L584:N584=\"\",I584&\"・\"&J584&\"・\"&K584,IF(M584:N584=\"\",I584&\"・\"&J584&\"・\"&K584&\"・\"&L584,IF(N584=\"\",I584&\"・\"&J584&\"・\"&K584&\"・\"&L584&\"・\"&M584,I584&\"・\"&J584&\"・\"&K584&\"・\"&L584&\"・\"&M584&\"・\"&N584))))))","v":""},"","","","",""]
[null,{"$f":"データリスト!AH$46","v":"電力年金"},{"$f":"IF(データリスト!$AH63=\"\",\"\",データリスト!$AH63)","v":""},{"$nulls":17},{"$f":"IF(I585:N585=\"\",\"\",IF(J585:N585=\"\",I585,IF(K585:N585=\"\",I585&\"・\"&J585,IF(L585:N585=\"\",I585&\"・\"&J585&\"・\"&K585,IF(M585:N585=\"\",I585&\"・\"&J585&\"・\"&K585&\"・\"&L585,IF(N585=\"\",I585&\"・\"&J585&\"・\"&K585&\"・\"&L585&\"・\"&M585,I585&\"・\"&J585&\"・\"&K585&\"・\"&L585&\"・\"&M585&\"・\"&N585))))))","v":""},"","","","",""]
[null,{"$f":"データリスト!AH$46","v":"電力年金"},{"$f":"IF(データリスト!$AH64=\"\",\"\",データリスト!$AH64)","v":""},{"$nulls":17},{"$f":"IF(I586:N586=\"\",\"\",IF(J586:N586=\"\",I586,IF(K586:N586=\"\",I586&\"・\"&J586,IF(L586:N586=\"\",I586&\"・\"&J586&\"・\"&K586,IF(M586:N586=\"\",I586&\"・\"&J586&\"・\"&K586&\"・\"&L586,IF(N586=\"\",I586&\"・\"&J586&\"・\"&K586&\"・\"&L586&\"・\"&M586,I586&\"・\"&J586&\"・\"&K586&\"・\"&L586&\"・\"&M586&\"・\"&N586))))))","v":""},"","","","",""]
[null,{"$f":"データリスト!AH$46","v":"電力年金"},{"$f":"IF(データリスト!$AH65=\"\",\"\",データリスト!$AH65)","v":""},{"$nulls":17},{"$f":"IF(I587:N587=\"\",\"\",IF(J587:N587=\"\",I587,IF(K587:N587=\"\",I587&\"・\"&J587,IF(L587:N587=\"\",I587&\"・\"&J587&\"・\"&K587,IF(M587:N587=\"\",I587&\"・\"&J587&\"・\"&K587&\"・\"&L587,IF(N587=\"\",I587&\"・\"&J587&\"・\"&K587&\"・\"&L587&\"・\"&M587,I587&\"・\"&J587&\"・\"&K587&\"・\"&L587&\"・\"&M587&\"・\"&N587))))))","v":""},"","","","",""]
[null,{"$f":"データリスト!AH$46","v":"電力年金"},{"$f":"IF(データリスト!$AH66=\"\",\"\",データリスト!$AH66)","v":""},{"$nulls":17},{"$f":"IF(I588:N588=\"\",\"\",IF(J588:N588=\"\",I588,IF(K588:N588=\"\",I588&\"・\"&J588,IF(L588:N588=\"\",I588&\"・\"&J588&\"・\"&K588,IF(M588:N588=\"\",I588&\"・\"&J588&\"・\"&K588&\"・\"&L588,IF(N588=\"\",I588&\"・\"&J588&\"・\"&K588&\"・\"&L588&\"・\"&M588,I588&\"・\"&J588&\"・\"&K588&\"・\"&L588&\"・\"&M588&\"・\"&N588))))))","v":""},"","","","",""]
[null,{"$f":"データリスト!AI$46","v":"国民共済"},{"$f":"IF(データリスト!$AI47=\"\",\"\",データリスト!$AI47)","v":"対外窓口"},{"$nulls":17},{"$f":"IF(I589:N589=\"\",\"\",IF(J589:N589=\"\",I589,IF(K589:N589=\"\",I589&\"・\"&J589,IF(L589:N589=\"\",I589&\"・\"&J589&\"・\"&K589,IF(M589:N589=\"\",I589&\"・\"&J589&\"・\"&K589&\"・\"&L589,IF(N589=\"\",I589&\"・\"&J589&\"・\"&K589&\"・\"&L589&\"・\"&M589,I589&\"・\"&J589&\"・\"&K589&\"・\"&L589&\"・\"&M589&\"・\"&N589))))))","v":""},"","","","",""]
[null,{"$f":"データリスト!AI$46","v":"国民共済"},{"$f":"IF(データリスト!$AI48=\"\",\"\",データリスト!$AI48)","v":"所内窓口"},{"$nulls":17},{"$f":"IF(I590:N590=\"\",\"\",IF(J590:N590=\"\",I590,IF(K590:N590=\"\",I590&\"・\"&J590,IF(L590:N590=\"\",I590&\"・\"&J590&\"・\"&K590,IF(M590:N590=\"\",I590&\"・\"&J590&\"・\"&K590&\"・\"&L590,IF(N590=\"\",I590&\"・\"&J590&\"・\"&K590&\"・\"&L590&\"・\"&M590,I590&\"・\"&J590&\"・\"&K590&\"・\"&L590&\"・\"&M590&\"・\"&N590))))))","v":""},"","","","",""]
[null,{"$f":"データリスト!AI$46","v":"国民共済"},{"$f":"IF(データリスト!$AI49=\"\",\"\",データリスト!$AI49)","v":"新規・更新案内"},{"$nulls":17},{"$f":"IF(I591:N591=\"\",\"\",IF(J591:N591=\"\",I591,IF(K591:N591=\"\",I591&\"・\"&J591,IF(L591:N591=\"\",I591&\"・\"&J591&\"・\"&K591,IF(M591:N591=\"\",I591&\"・\"&J591&\"・\"&K591&\"・\"&L591,IF(N591=\"\",I591&\"・\"&J591&\"・\"&K591&\"・\"&L591&\"・\"&M591,I591&\"・\"&J591&\"・\"&K591&\"・\"&L591&\"・\"&M591&\"・\"&N591))))))","v":""},"","","","",""]
[null,{"$f":"データリスト!AI$46","v":"国民共済"},{"$f":"IF(データリスト!$AI50=\"\",\"\",データリスト!$AI50)","v":"資料・申込書配布"},{"$nulls":17},{"$f":"IF(I592:N592=\"\",\"\",IF(J592:N592=\"\",I592,IF(K592:N592=\"\",I592&\"・\"&J592,IF(L592:N592=\"\",I592&\"・\"&J592&\"・\"&K592,IF(M592:N592=\"\",I592&\"・\"&J592&\"・\"&K592&\"・\"&L592,IF(N592=\"\",I592&\"・\"&J592&\"・\"&K592&\"・\"&L592&\"・\"&M592,I592&\"・\"&J592&\"・\"&K592&\"・\"&L592&\"・\"&M592&\"・\"&N592))))))","v":""},"","","","",""]
[null,{"$f":"データリスト!AI$46","v":"国民共済"},{"$f":"IF(データリスト!$AI51=\"\",\"\",データリスト!$AI51)","v":"日程調整"},{"$nulls":17},{"$f":"IF(I593:N593=\"\",\"\",IF(J593:N593=\"\",I593,IF(K593:N593=\"\",I593&\"・\"&J593,IF(L593:N593=\"\",I593&\"・\"&J593&\"・\"&K593,IF(M593:N593=\"\",I593&\"・\"&J593&\"・\"&K593&\"・\"&L593,IF(N593=\"\",I593&\"・\"&J593&\"・\"&K593&\"・\"&L593&\"・\"&M593,I593&\"・\"&J593&\"・\"&K593&\"・\"&L593&\"・\"&M593&\"・\"&N593))))))","v":""},"","","","",""]
[null,{"$f":"データリスト!AI$46","v":"国民共済"},{"$f":"IF(データリスト!$AI52=\"\",\"\",データリスト!$AI52)","v":"職場周知"},{"$nulls":17},{"$f":"IF(I594:N594=\"\",\"\",IF(J594:N594=\"\",I594,IF(K594:N594=\"\",I594&\"・\"&J594,IF(L594:N594=\"\",I594&\"・\"&J594&\"・\"&K594,IF(M594:N594=\"\",I594&\"・\"&J594&\"・\"&K594&\"・\"&L594,IF(N594=\"\",I594&\"・\"&J594&\"・\"&K594&\"・\"&L594&\"・\"&M594,I594&\"・\"&J594&\"・\"&K594&\"・\"&L594&\"・\"&M594&\"・\"&N594))))))","v":""},"","","","",""]
[null,{"$f":"データリスト!AI$46","v":"国民共済"},{"$f":"IF(データリスト!$AI53=\"\",\"\",データリスト!$AI53)","v":"会場調整"},{"$nulls":17},{"$f":"IF(I595:N595=\"\",\"\",IF(J595:N595=\"\",I595,IF(K595:N595=\"\",I595&\"・\"&J595,IF(L595:N595=\"\",I595&\"・\"&J595&\"・\"&K595,IF(M595:N595=\"\",I595&\"・\"&J595&\"・\"&K595&\"・\"&L595,IF(N595=\"\",I595&\"・\"&J595&\"・\"&K595&\"・\"&L595&\"・\"&M595,I595&\"・\"&J595&\"・\"&K595&\"・\"&L595&\"・\"&M595&\"・\"&N595))))))","v":""},"","","","",""]
[null,{"$f":"データリスト!AI$46","v":"国民共済"},{"$f":"IF(データリスト!$AI54=\"\",\"\",データリスト!$AI54)","v":"会場準備"},{"$nulls":17},{"$f":"IF(I596:N596=\"\",\"\",IF(J596:N596=\"\",I596,IF(K596:N596=\"\",I596&\"・\"&J596,IF(L596:N596=\"\",I596&\"・\"&J596&\"・\"&K596,IF(M596:N596=\"\",I596&\"・\"&J596&\"・\"&K596&\"・\"&L596,IF(N596=\"\",I596&\"・\"&J596&\"・\"&K596&\"・\"&L596&\"・\"&M596,I596&\"・\"&J596&\"・\"&K596&\"・\"&L596&\"・\"&M596&\"・\"&N596))))))","v":""},"","","","",""]
[null,{"$f":"データリスト!AI$46","v":"国民共済"},{"$f":"IF(データリスト!$AI55=\"\",\"\",データリスト!$AI55)","v":"説明会司会"},{"$nulls":17},{"$f":"IF(I597:N597=\"\",\"\",IF(J597:N597=\"\",I597,IF(K597:N597=\"\",I597&\"・\"&J597,IF(L597:N597=\"\",I597&\"・\"&J597&\"・\"&K597,IF(M597:N597=\"\",I597&\"・\"&J597&\"・\"&K597&\"・\"&L597,IF(N597=\"\",I597&\"・\"&J597&\"・\"&K597&\"・\"&L597&\"・\"&M597,I597&\"・\"&J597&\"・\"&K597&\"・\"&L597&\"・\"&M597&\"・\"&N597))))))","v":""},"","","","",""]
[null,{"$f":"データリスト!AI$46","v":"国民共済"},{"$f":"IF(データリスト!$AI56=\"\",\"\",データリスト!$AI56)","v":"会場片付け"},{"$nulls":17},{"$f":"IF(I598:N598=\"\",\"\",IF(J598:N598=\"\",I598,IF(K598:N598=\"\",I598&\"・\"&J598,IF(L598:N598=\"\",I598&\"・\"&J598&\"・\"&K598,IF(M598:N598=\"\",I598&\"・\"&J598&\"・\"&K598&\"・\"&L598,IF(N598=\"\",I598&\"・\"&J598&\"・\"&K598&\"・\"&L598&\"・\"&M598,I598&\"・\"&J598&\"・\"&K598&\"・\"&L598&\"・\"&M598&\"・\"&N598))))))","v":""},"","","","",""]
[null,{"$f":"データリスト!AI$46","v":"国民共済"},{"$f":"IF(データリスト!$AI57=\"\",\"\",データリスト!$AI57)","v":"申込書回収"},{"$nulls":17},{"$f":"IF(I599:N599=\"\",\"\",IF(J599:N599=\"\",I599,IF(K599:N599=\"\",I599&\"・\"&J599,IF(L599:N599=\"\",I599&\"・\"&J599&\"・\"&K599,IF(M599:N599=\"\",I599&\"・\"&J599&\"・\"&K599&\"・\"&L599,IF(N599=\"\",I599&\"・\"&J599&\"・\"&K599&\"・\"&L599&\"・\"&M599,I599&\"・\"&J599&\"・\"&K599&\"・\"&L599&\"・\"&M599&\"・\"&N599))))))","v":""},"","","","",""]
[null,{"$f":"データリスト!AI$46","v":"国民共済"},{"$f":"IF(データリスト!$AI58=\"\",\"\",データリスト!$AI58)","v":"書類の確認"},{"$nulls":17},{"$f":"IF(I600:N600=\"\",\"\",IF(J600:N600=\"\",I600,IF(K600:N600=\"\",I600&\"・\"&J600,IF(L600:N600=\"\",I600&\"・\"&J600&\"・\"&K600,IF(M600:N600=\"\",I600&\"・\"&J600&\"・\"&K600&\"・\"&L600,IF(N600=\"\",I600&\"・\"&J600&\"・\"&K600&\"・\"&L600&\"・\"&M600,I600&\"・\"&J600&\"・\"&K600&\"・\"&L600&\"・\"&M600&\"・\"&N600))))))","v":""},"","","","",""]
[null,{"$f":"データリスト!AI$46","v":"国民共済"},{"$f":"IF(データリスト!$AI59=\"\",\"\",データリスト!$AI59)","v":"書類の提出"},{"$nulls":17},{"$f":"IF(I601:N601=\"\",\"\",IF(J601:N601=\"\",I601,IF(K601:N601=\"\",I601&\"・\"&J601,IF(L601:N601=\"\",I601&\"・\"&J601&\"・\"&K601,IF(M601:N601=\"\",I601&\"・\"&J601&\"・\"&K601&\"・\"&L601,IF(N601=\"\",I601&\"・\"&J601&\"・\"&K601&\"・\"&L601&\"・\"&M601,I601&\"・\"&J601&\"・\"&K601&\"・\"&L601&\"・\"&M601&\"・\"&N601))))))","v":""},"","","","",""]
[null,{"$f":"データリスト!AI$46","v":"国民共済"},{"$f":"IF(データリスト!$AI60=\"\",\"\",データリスト!$AI60)","v":""},{"$nulls":17},{"$f":"IF(I602:N602=\"\",\"\",IF(J602:N602=\"\",I602,IF(K602:N602=\"\",I602&\"・\"&J602,IF(L602:N602=\"\",I602&\"・\"&J602&\"・\"&K602,IF(M602:N602=\"\",I602&\"・\"&J602&\"・\"&K602&\"・\"&L602,IF(N602=\"\",I602&\"・\"&J602&\"・\"&K602&\"・\"&L602&\"・\"&M602,I602&\"・\"&J602&\"・\"&K602&\"・\"&L602&\"・\"&M602&\"・\"&N602))))))","v":""},"","","","",""]
[null,{"$f":"データリスト!AI$46","v":"国民共済"},{"$f":"IF(データリスト!$AI61=\"\",\"\",データリスト!$AI61)","v":""},{"$nulls":17},{"$f":"IF(I603:N603=\"\",\"\",IF(J603:N603=\"\",I603,IF(K603:N603=\"\",I603&\"・\"&J603,IF(L603:N603=\"\",I603&\"・\"&J603&\"・\"&K603,IF(M603:N603=\"\",I603&\"・\"&J603&\"・\"&K603&\"・\"&L603,IF(N603=\"\",I603&\"・\"&J603&\"・\"&K603&\"・\"&L603&\"・\"&M603,I603&\"・\"&J603&\"・\"&K603&\"・\"&L603&\"・\"&M603&\"・\"&N603))))))","v":""},"","","","",""]
[null,{"$f":"データリスト!AI$46","v":"国民共済"},{"$f":"IF(データリスト!$AI62=\"\",\"\",データリスト!$AI62)","v":""},{"$nulls":17},{"$f":"IF(I604:N604=\"\",\"\",IF(J604:N604=\"\",I604,IF(K604:N604=\"\",I604&\"・\"&J604,IF(L604:N604=\"\",I604&\"・\"&J604&\"・\"&K604,IF(M604:N604=\"\",I604&\"・\"&J604&\"・\"&K604&\"・\"&L604,IF(N604=\"\",I604&\"・\"&J604&\"・\"&K604&\"・\"&L604&\"・\"&M604,I604&\"・\"&J604&\"・\"&K604&\"・\"&L604&\"・\"&M604&\"・\"&N604))))))","v":""},"","","","",""]
[null,{"$f":"データリスト!AI$46","v":"国民共済"},{"$f":"IF(データリスト!$AI63=\"\",\"\",データリスト!$AI63)","v":""},{"$nulls":17},{"$f":"IF(I605:N605=\"\",\"\",IF(J605:N605=\"\",I605,IF(K605:N605=\"\",I605&\"・\"&J605,IF(L605:N605=\"\",I605&\"・\"&J605&\"・\"&K605,IF(M605:N605=\"\",I605&\"・\"&J605&\"・\"&K605&\"・\"&L605,IF(N605=\"\",I605&\"・\"&J605&\"・\"&K605&\"・\"&L605&\"・\"&M605,I605&\"・\"&J605&\"・\"&K605&\"・\"&L605&\"・\"&M605&\"・\"&N605))))))","v":""},"","","","",""]
[null,{"$f":"データリスト!AI$46","v":"国民共済"},{"$f":"IF(データリスト!$AI64=\"\",\"\",データリスト!$AI64)","v":""},{"$nulls":17},{"$f":"IF(I606:N606=\"\",\"\",IF(J606:N606=\"\",I606,IF(K606:N606=\"\",I606&\"・\"&J606,IF(L606:N606=\"\",I606&\"・\"&J606&\"・\"&K606,IF(M606:N606=\"\",I606&\"・\"&J606&\"・\"&K606&\"・\"&L606,IF(N606=\"\",I606&\"・\"&J606&\"・\"&K606&\"・\"&L606&\"・\"&M606,I606&\"・\"&J606&\"・\"&K606&\"・\"&L606&\"・\"&M606&\"・\"&N606))))))","v":""},"","","","",""]
[null,{"$f":"データリスト!AI$46","v":"国民共済"},{"$f":"IF(データリスト!$AI65=\"\",\"\",データリスト!$AI65)","v":""},{"$nulls":17},{"$f":"IF(I607:N607=\"\",\"\",IF(J607:N607=\"\",I607,IF(K607:N607=\"\",I607&\"・\"&J607,IF(L607:N607=\"\",I607&\"・\"&J607&\"・\"&K607,IF(M607:N607=\"\",I607&\"・\"&J607&\"・\"&K607&\"・\"&L607,IF(N607=\"\",I607&\"・\"&J607&\"・\"&K607&\"・\"&L607&\"・\"&M607,I607&\"・\"&J607&\"・\"&K607&\"・\"&L607&\"・\"&M607&\"・\"&N607))))))","v":""},"","","","",""]
[null,{"$f":"データリスト!AI$46","v":"国民共済"},{"$f":"IF(データリスト!$AI66=\"\",\"\",データリスト!$AI66)","v":""},{"$nulls":17},{"$f":"IF(I608:N608=\"\",\"\",IF(J608:N608=\"\",I608,IF(K608:N608=\"\",I608&\"・\"&J608,IF(L608:N608=\"\",I608&\"・\"&J608&\"・\"&K608,IF(M608:N608=\"\",I608&\"・\"&J608&\"・\"&K608&\"・\"&L608,IF(N608=\"\",I608&\"・\"&J608&\"・\"&K608&\"・\"&L608&\"・\"&M608,I608&\"・\"&J608&\"・\"&K608&\"・\"&L608&\"・\"&M608&\"・\"&N608))))))","v":""},"","","","",""]
[null,{"$f":"データリスト!AJ$46","v":"その他共済"},{"$f":"IF(データリスト!AJ47=\"\",\"\",データリスト!AJ47)","v":"概要周知"},{"$nulls":17},{"$f":"IF(I609:N609=\"\",\"\",IF(J609:N609=\"\",I609,IF(K609:N609=\"\",I609&\"・\"&J609,IF(L609:N609=\"\",I609&\"・\"&J609&\"・\"&K609,IF(M609:N609=\"\",I609&\"・\"&J609&\"・\"&K609&\"・\"&L609,IF(N609=\"\",I609&\"・\"&J609&\"・\"&K609&\"・\"&L609&\"・\"&M609,I609&\"・\"&J609&\"・\"&K609&\"・\"&L609&\"・\"&M609&\"・\"&N609))))))","v":""},"","","","",""]
[null,{"$f":"データリスト!AJ$46","v":"その他共済"},{"$f":"IF(データリスト!AJ48=\"\",\"\",データリスト!AJ48)","v":"申請書類の確認"},{"$nulls":17},{"$f":"IF(I610:N610=\"\",\"\",IF(J610:N610=\"\",I610,IF(K610:N610=\"\",I610&\"・\"&J610,IF(L610:N610=\"\",I610&\"・\"&J610&\"・\"&K610,IF(M610:N610=\"\",I610&\"・\"&J610&\"・\"&K610&\"・\"&L610,IF(N610=\"\",I610&\"・\"&J610&\"・\"&K610&\"・\"&L610&\"・\"&M610,I610&\"・\"&J610&\"・\"&K610&\"・\"&L610&\"・\"&M610&\"・\"&N610))))))","v":""},"","","","",""]
[null,{"$f":"データリスト!AJ$46","v":"その他共済"},{"$f":"IF(データリスト!AJ49=\"\",\"\",データリスト!AJ49)","v":"各種申請"},{"$nulls":17},{"$f":"IF(I611:N611=\"\",\"\",IF(J611:N611=\"\",I611,IF(K611:N611=\"\",I611&\"・\"&J611,IF(L611:N611=\"\",I611&\"・\"&J611&\"・\"&K611,IF(M611:N611=\"\",I611&\"・\"&J611&\"・\"&K611&\"・\"&L611,IF(N611=\"\",I611&\"・\"&J611&\"・\"&K611&\"・\"&L611&\"・\"&M611,I611&\"・\"&J611&\"・\"&K611&\"・\"&L611&\"・\"&M611&\"・\"&N611))))))","v":""},"","","","",""]
[null,{"$f":"データリスト!AJ$46","v":"その他共済"},{"$f":"IF(データリスト!AJ50=\"\",\"\",データリスト!AJ50)","v":"金額確認・引出し"},{"$nulls":17},{"$f":"IF(I612:N612=\"\",\"\",IF(J612:N612=\"\",I612,IF(K612:N612=\"\",I612&\"・\"&J612,IF(L612:N612=\"\",I612&\"・\"&J612&\"・\"&K612,IF(M612:N612=\"\",I612&\"・\"&J612&\"・\"&K612&\"・\"&L612,IF(N612=\"\",I612&\"・\"&J612&\"・\"&K612&\"・\"&L612&\"・\"&M612,I612&\"・\"&J612&\"・\"&K612&\"・\"&L612&\"・\"&M612&\"・\"&N612))))))","v":""},"","","","",""]
[null,{"$f":"データリスト!AJ$46","v":"その他共済"},{"$f":"IF(データリスト!AJ51=\"\",\"\",データリスト!AJ51)","v":"金種分け・袋詰め"},{"$nulls":17},{"$f":"IF(I613:N613=\"\",\"\",IF(J613:N613=\"\",I613,IF(K613:N613=\"\",I613&\"・\"&J613,IF(L613:N613=\"\",I613&\"・\"&J613&\"・\"&K613,IF(M613:N613=\"\",I613&\"・\"&J613&\"・\"&K613&\"・\"&L613,IF(N613=\"\",I613&\"・\"&J613&\"・\"&K613&\"・\"&L613&\"・\"&M613,I613&\"・\"&J613&\"・\"&K613&\"・\"&L613&\"・\"&M613&\"・\"&N613))))))","v":""},"","","","",""]
[null,{"$f":"データリスト!AJ$46","v":"その他共済"},{"$f":"IF(データリスト!AJ52=\"\",\"\",データリスト!AJ52)","v":"保険金控除証明書"},{"$nulls":17},{"$f":"IF(I614:N614=\"\",\"\",IF(J614:N614=\"\",I614,IF(K614:N614=\"\",I614&\"・\"&J614,IF(L614:N614=\"\",I614&\"・\"&J614&\"・\"&K614,IF(M614:N614=\"\",I614&\"・\"&J614&\"・\"&K614&\"・\"&L614,IF(N614=\"\",I614&\"・\"&J614&\"・\"&K614&\"・\"&L614&\"・\"&M614,I614&\"・\"&J614&\"・\"&K614&\"・\"&L614&\"・\"&M614&\"・\"&N614))))))","v":""},"","","","",""]
[null,{"$f":"データリスト!AJ$46","v":"その他共済"},{"$f":"IF(データリスト!AJ53=\"\",\"\",データリスト!AJ53)","v":"慶弔共済金請求"},{"$nulls":17},{"$f":"IF(I615:N615=\"\",\"\",IF(J615:N615=\"\",I615,IF(K615:N615=\"\",I615&\"・\"&J615,IF(L615:N615=\"\",I615&\"・\"&J615&\"・\"&K615,IF(M615:N615=\"\",I615&\"・\"&J615&\"・\"&K615&\"・\"&L615,IF(N615=\"\",I615&\"・\"&J615&\"・\"&K615&\"・\"&L615&\"・\"&M615,I615&\"・\"&J615&\"・\"&K615&\"・\"&L615&\"・\"&M615&\"・\"&N615))))))","v":""},"","","","",""]
[null,{"$f":"データリスト!AJ$46","v":"その他共済"},{"$f":"IF(データリスト!AJ54=\"\",\"\",データリスト!AJ54)","v":""},{"$nulls":17},{"$f":"IF(I616:N616=\"\",\"\",IF(J616:N616=\"\",I616,IF(K616:N616=\"\",I616&\"・\"&J616,IF(L616:N616=\"\",I616&\"・\"&J616&\"・\"&K616,IF(M616:N616=\"\",I616&\"・\"&J616&\"・\"&K616&\"・\"&L616,IF(N616=\"\",I616&\"・\"&J616&\"・\"&K616&\"・\"&L616&\"・\"&M616,I616&\"・\"&J616&\"・\"&K616&\"・\"&L616&\"・\"&M616&\"・\"&N616))))))","v":""},"","","","",""]
[null,{"$f":"データリスト!AJ$46","v":"その他共済"},{"$f":"IF(データリスト!AJ55=\"\",\"\",データリスト!AJ55)","v":""},{"$nulls":17},{"$f":"IF(I617:N617=\"\",\"\",IF(J617:N617=\"\",I617,IF(K617:N617=\"\",I617&\"・\"&J617,IF(L617:N617=\"\",I617&\"・\"&J617&\"・\"&K617,IF(M617:N617=\"\",I617&\"・\"&J617&\"・\"&K617&\"・\"&L617,IF(N617=\"\",I617&\"・\"&J617&\"・\"&K617&\"・\"&L617&\"・\"&M617,I617&\"・\"&J617&\"・\"&K617&\"・\"&L617&\"・\"&M617&\"・\"&N617))))))","v":""},"","","","",""]
[null,{"$f":"データリスト!AJ$46","v":"その他共済"},{"$f":"IF(データリスト!AJ56=\"\",\"\",データリスト!AJ56)","v":""},{"$nulls":17},{"$f":"IF(I618:N618=\"\",\"\",IF(J618:N618=\"\",I618,IF(K618:N618=\"\",I618&\"・\"&J618,IF(L618:N618=\"\",I618&\"・\"&J618&\"・\"&K618,IF(M618:N618=\"\",I618&\"・\"&J618&\"・\"&K618&\"・\"&L618,IF(N618=\"\",I618&\"・\"&J618&\"・\"&K618&\"・\"&L618&\"・\"&M618,I618&\"・\"&J618&\"・\"&K618&\"・\"&L618&\"・\"&M618&\"・\"&N618))))))","v":""},"","","","",""]
[null,{"$f":"データリスト!AJ$46","v":"その他共済"},{"$f":"IF(データリスト!AJ57=\"\",\"\",データリスト!AJ57)","v":""},{"$nulls":17},{"$f":"IF(I619:N619=\"\",\"\",IF(J619:N619=\"\",I619,IF(K619:N619=\"\",I619&\"・\"&J619,IF(L619:N619=\"\",I619&\"・\"&J619&\"・\"&K619,IF(M619:N619=\"\",I619&\"・\"&J619&\"・\"&K619&\"・\"&L619,IF(N619=\"\",I619&\"・\"&J619&\"・\"&K619&\"・\"&L619&\"・\"&M619,I619&\"・\"&J619&\"・\"&K619&\"・\"&L619&\"・\"&M619&\"・\"&N619))))))","v":""},"","","","",""]
[null,{"$f":"データリスト!AJ$46","v":"その他共済"},{"$f":"IF(データリスト!AJ58=\"\",\"\",データリスト!AJ58)","v":""},{"$nulls":17},{"$f":"IF(I620:N620=\"\",\"\",IF(J620:N620=\"\",I620,IF(K620:N620=\"\",I620&\"・\"&J620,IF(L620:N620=\"\",I620&\"・\"&J620&\"・\"&K620,IF(M620:N620=\"\",I620&\"・\"&J620&\"・\"&K620&\"・\"&L620,IF(N620=\"\",I620&\"・\"&J620&\"・\"&K620&\"・\"&L620&\"・\"&M620,I620&\"・\"&J620&\"・\"&K620&\"・\"&L620&\"・\"&M620&\"・\"&N620))))))","v":""},"","","","",""]
[null,{"$f":"データリスト!AJ$46","v":"その他共済"},{"$f":"IF(データリスト!AJ59=\"\",\"\",データリスト!AJ59)","v":""},{"$nulls":17},{"$f":"IF(I621:N621=\"\",\"\",IF(J621:N621=\"\",I621,IF(K621:N621=\"\",I621&\"・\"&J621,IF(L621:N621=\"\",I621&\"・\"&J621&\"・\"&K621,IF(M621:N621=\"\",I621&\"・\"&J621&\"・\"&K621&\"・\"&L621,IF(N621=\"\",I621&\"・\"&J621&\"・\"&K621&\"・\"&L621&\"・\"&M621,I621&\"・\"&J621&\"・\"&K621&\"・\"&L621&\"・\"&M621&\"・\"&N621))))))","v":""},"","","","",""]
[null,{"$f":"データリスト!AJ$46","v":"その他共済"},{"$f":"IF(データリスト!AJ60=\"\",\"\",データリスト!AJ60)","v":""},{"$nulls":17},{"$f":"IF(I622:N622=\"\",\"\",IF(J622:N622=\"\",I622,IF(K622:N622=\"\",I622&\"・\"&J622,IF(L622:N622=\"\",I622&\"・\"&J622&\"・\"&K622,IF(M622:N622=\"\",I622&\"・\"&J622&\"・\"&K622&\"・\"&L622,IF(N622=\"\",I622&\"・\"&J622&\"・\"&K622&\"・\"&L622&\"・\"&M622,I622&\"・\"&J622&\"・\"&K622&\"・\"&L622&\"・\"&M622&\"・\"&N622))))))","v":""},"","","","",""]
[null,{"$f":"データリスト!AJ$46","v":"その他共済"},{"$f":"IF(データリスト!AJ61=\"\",\"\",データリスト!AJ61)","v":""},{"$nulls":17},{"$f":"IF(I623:N623=\"\",\"\",IF(J623:N623=\"\",I623,IF(K623:N623=\"\",I623&\"・\"&J623,IF(L623:N623=\"\",I623&\"・\"&J623&\"・\"&K623,IF(M623:N623=\"\",I623&\"・\"&J623&\"・\"&K623&\"・\"&L623,IF(N623=\"\",I623&\"・\"&J623&\"・\"&K623&\"・\"&L623&\"・\"&M623,I623&\"・\"&J623&\"・\"&K623&\"・\"&L623&\"・\"&M623&\"・\"&N623))))))","v":""},"","","","",""]
[null,{"$f":"データリスト!AJ$46","v":"その他共済"},{"$f":"IF(データリスト!AJ62=\"\",\"\",データリスト!AJ62)","v":""},{"$nulls":17},{"$f":"IF(I624:N624=\"\",\"\",IF(J624:N624=\"\",I624,IF(K624:N624=\"\",I624&\"・\"&J624,IF(L624:N624=\"\",I624&\"・\"&J624&\"・\"&K624,IF(M624:N624=\"\",I624&\"・\"&J624&\"・\"&K624&\"・\"&L624,IF(N624=\"\",I624&\"・\"&J624&\"・\"&K624&\"・\"&L624&\"・\"&M624,I624&\"・\"&J624&\"・\"&K624&\"・\"&L624&\"・\"&M624&\"・\"&N624))))))","v":""},"","","","",""]
[null,{"$f":"データリスト!AJ$46","v":"その他共済"},{"$f":"IF(データリスト!AJ63=\"\",\"\",データリスト!AJ63)","v":""},{"$nulls":17},{"$f":"IF(I625:N625=\"\",\"\",IF(J625:N625=\"\",I625,IF(K625:N625=\"\",I625&\"・\"&J625,IF(L625:N625=\"\",I625&\"・\"&J625&\"・\"&K625,IF(M625:N625=\"\",I625&\"・\"&J625&\"・\"&K625&\"・\"&L625,IF(N625=\"\",I625&\"・\"&J625&\"・\"&K625&\"・\"&L625&\"・\"&M625,I625&\"・\"&J625&\"・\"&K625&\"・\"&L625&\"・\"&M625&\"・\"&N625))))))","v":""},"","","","",""]
[null,{"$f":"データリスト!AJ$46","v":"その他共済"},{"$f":"IF(データリスト!AJ64=\"\",\"\",データリスト!AJ64)","v":""},{"$nulls":17},{"$f":"IF(I626:N626=\"\",\"\",IF(J626:N626=\"\",I626,IF(K626:N626=\"\",I626&\"・\"&J626,IF(L626:N626=\"\",I626&\"・\"&J626&\"・\"&K626,IF(M626:N626=\"\",I626&\"・\"&J626&\"・\"&K626&\"・\"&L626,IF(N626=\"\",I626&\"・\"&J626&\"・\"&K626&\"・\"&L626&\"・\"&M626,I626&\"・\"&J626&\"・\"&K626&\"・\"&L626&\"・\"&M626&\"・\"&N626))))))","v":""},"","","","",""]
[null,{"$f":"データリスト!AJ$46","v":"その他共済"},{"$f":"IF(データリスト!AJ65=\"\",\"\",データリスト!AJ65)","v":""},{"$nulls":17},{"$f":"IF(I627:N627=\"\",\"\",IF(J627:N627=\"\",I627,IF(K627:N627=\"\",I627&\"・\"&J627,IF(L627:N627=\"\",I627&\"・\"&J627&\"・\"&K627,IF(M627:N627=\"\",I627&\"・\"&J627&\"・\"&K627&\"・\"&L627,IF(N627=\"\",I627&\"・\"&J627&\"・\"&K627&\"・\"&L627&\"・\"&M627,I627&\"・\"&J627&\"・\"&K627&\"・\"&L627&\"・\"&M627&\"・\"&N627))))))","v":""},"","","","",""]
[null,{"$f":"データリスト!AJ$46","v":"その他共済"},{"$f":"IF(データリスト!AJ66=\"\",\"\",データリスト!AJ66)","v":""},{"$nulls":17},{"$f":"IF(I628:N628=\"\",\"\",IF(J628:N628=\"\",I628,IF(K628:N628=\"\",I628&\"・\"&J628,IF(L628:N628=\"\",I628&\"・\"&J628&\"・\"&K628,IF(M628:N628=\"\",I628&\"・\"&J628&\"・\"&K628&\"・\"&L628,IF(N628=\"\",I628&\"・\"&J628&\"・\"&K628&\"・\"&L628&\"・\"&M628,I628&\"・\"&J628&\"・\"&K628&\"・\"&L628&\"・\"&M628&\"・\"&N628))))))","v":""},"","","","",""]
[null,{"$f":"データリスト!AK$46","v":"その他1"},{"$f":"IF(データリスト!AK47=\"\",\"\",データリスト!AK47)","v":""},{"$nulls":17},{"$f":"IF(I629:N629=\"\",\"\",IF(J629:N629=\"\",I629,IF(K629:N629=\"\",I629&\"・\"&J629,IF(L629:N629=\"\",I629&\"・\"&J629&\"・\"&K629,IF(M629:N629=\"\",I629&\"・\"&J629&\"・\"&K629&\"・\"&L629,IF(N629=\"\",I629&\"・\"&J629&\"・\"&K629&\"・\"&L629&\"・\"&M629,I629&\"・\"&J629&\"・\"&K629&\"・\"&L629&\"・\"&M629&\"・\"&N629))))))","v":""},"","","","",""]
[null,{"$f":"データリスト!AK$46","v":"その他1"},{"$f":"IF(データリスト!AK48=\"\",\"\",データリスト!AK48)","v":""},{"$nulls":17},{"$f":"IF(I630:N630=\"\",\"\",IF(J630:N630=\"\",I630,IF(K630:N630=\"\",I630&\"・\"&J630,IF(L630:N630=\"\",I630&\"・\"&J630&\"・\"&K630,IF(M630:N630=\"\",I630&\"・\"&J630&\"・\"&K630&\"・\"&L630,IF(N630=\"\",I630&\"・\"&J630&\"・\"&K630&\"・\"&L630&\"・\"&M630,I630&\"・\"&J630&\"・\"&K630&\"・\"&L630&\"・\"&M630&\"・\"&N630))))))","v":""},"","","","",""]
[null,{"$f":"データリスト!AK$46","v":"その他1"},{"$f":"IF(データリスト!AK49=\"\",\"\",データリスト!AK49)","v":""},{"$nulls":17},{"$f":"IF(I631:N631=\"\",\"\",IF(J631:N631=\"\",I631,IF(K631:N631=\"\",I631&\"・\"&J631,IF(L631:N631=\"\",I631&\"・\"&J631&\"・\"&K631,IF(M631:N631=\"\",I631&\"・\"&J631&\"・\"&K631&\"・\"&L631,IF(N631=\"\",I631&\"・\"&J631&\"・\"&K631&\"・\"&L631&\"・\"&M631,I631&\"・\"&J631&\"・\"&K631&\"・\"&L631&\"・\"&M631&\"・\"&N631))))))","v":""},"","","","",""]
[null,{"$f":"データリスト!AK$46","v":"その他1"},{"$f":"IF(データリスト!AK50=\"\",\"\",データリスト!AK50)","v":""},{"$nulls":17},{"$f":"IF(I632:N632=\"\",\"\",IF(J632:N632=\"\",I632,IF(K632:N632=\"\",I632&\"・\"&J632,IF(L632:N632=\"\",I632&\"・\"&J632&\"・\"&K632,IF(M632:N632=\"\",I632&\"・\"&J632&\"・\"&K632&\"・\"&L632,IF(N632=\"\",I632&\"・\"&J632&\"・\"&K632&\"・\"&L632&\"・\"&M632,I632&\"・\"&J632&\"・\"&K632&\"・\"&L632&\"・\"&M632&\"・\"&N632))))))","v":""},"","","","",""]
[null,{"$f":"データリスト!AK$46","v":"その他1"},{"$f":"IF(データリスト!AK51=\"\",\"\",データリスト!AK51)","v":""},{"$nulls":17},{"$f":"IF(I633:N633=\"\",\"\",IF(J633:N633=\"\",I633,IF(K633:N633=\"\",I633&\"・\"&J633,IF(L633:N633=\"\",I633&\"・\"&J633&\"・\"&K633,IF(M633:N633=\"\",I633&\"・\"&J633&\"・\"&K633&\"・\"&L633,IF(N633=\"\",I633&\"・\"&J633&\"・\"&K633&\"・\"&L633&\"・\"&M633,I633&\"・\"&J633&\"・\"&K633&\"・\"&L633&\"・\"&M633&\"・\"&N633))))))","v":""},"","","","",""]
[null,{"$f":"データリスト!AK$46","v":"その他1"},{"$f":"IF(データリスト!AK52=\"\",\"\",データリスト!AK52)","v":""},{"$nulls":17},{"$f":"IF(I634:N634=\"\",\"\",IF(J634:N634=\"\",I634,IF(K634:N634=\"\",I634&\"・\"&J634,IF(L634:N634=\"\",I634&\"・\"&J634&\"・\"&K634,IF(M634:N634=\"\",I634&\"・\"&J634&\"・\"&K634&\"・\"&L634,IF(N634=\"\",I634&\"・\"&J634&\"・\"&K634&\"・\"&L634&\"・\"&M634,I634&\"・\"&J634&\"・\"&K634&\"・\"&L634&\"・\"&M634&\"・\"&N634))))))","v":""},"","","","",""]
[null,{"$f":"データリスト!AK$46","v":"その他1"},{"$f":"IF(データリスト!AK53=\"\",\"\",データリスト!AK53)","v":""},{"$nulls":17},{"$f":"IF(I635:N635=\"\",\"\",IF(J635:N635=\"\",I635,IF(K635:N635=\"\",I635&\"・\"&J635,IF(L635:N635=\"\",I635&\"・\"&J635&\"・\"&K635,IF(M635:N635=\"\",I635&\"・\"&J635&\"・\"&K635&\"・\"&L635,IF(N635=\"\",I635&\"・\"&J635&\"・\"&K635&\"・\"&L635&\"・\"&M635,I635&\"・\"&J635&\"・\"&K635&\"・\"&L635&\"・\"&M635&\"・\"&N635))))))","v":""},"","","","",""]
[null,{"$f":"データリスト!AK$46","v":"その他1"},{"$f":"IF(データリスト!AK54=\"\",\"\",データリスト!AK54)","v":""},{"$nulls":17},{"$f":"IF(I636:N636=\"\",\"\",IF(J636:N636=\"\",I636,IF(K636:N636=\"\",I636&\"・\"&J636,IF(L636:N636=\"\",I636&\"・\"&J636&\"・\"&K636,IF(M636:N636=\"\",I636&\"・\"&J636&\"・\"&K636&\"・\"&L636,IF(N636=\"\",I636&\"・\"&J636&\"・\"&K636&\"・\"&L636&\"・\"&M636,I636&\"・\"&J636&\"・\"&K636&\"・\"&L636&\"・\"&M636&\"・\"&N636))))))","v":""},"","","","",""]
[null,{"$f":"データリスト!AK$46","v":"その他1"},{"$f":"IF(データリスト!AK55=\"\",\"\",データリスト!AK55)","v":""},{"$nulls":17},{"$f":"IF(I637:N637=\"\",\"\",IF(J637:N637=\"\",I637,IF(K637:N637=\"\",I637&\"・\"&J637,IF(L637:N637=\"\",I637&\"・\"&J637&\"・\"&K637,IF(M637:N637=\"\",I637&\"・\"&J637&\"・\"&K637&\"・\"&L637,IF(N637=\"\",I637&\"・\"&J637&\"・\"&K637&\"・\"&L637&\"・\"&M637,I637&\"・\"&J637&\"・\"&K637&\"・\"&L637&\"・\"&M637&\"・\"&N637))))))","v":""},"","","","",""]
[null,{"$f":"データリスト!AK$46","v":"その他1"},{"$f":"IF(データリスト!AK56=\"\",\"\",データリスト!AK56)","v":""},{"$nulls":17},{"$f":"IF(I638:N638=\"\",\"\",IF(J638:N638=\"\",I638,IF(K638:N638=\"\",I638&\"・\"&J638,IF(L638:N638=\"\",I638&\"・\"&J638&\"・\"&K638,IF(M638:N638=\"\",I638&\"・\"&J638&\"・\"&K638&\"・\"&L638,IF(N638=\"\",I638&\"・\"&J638&\"・\"&K638&\"・\"&L638&\"・\"&M638,I638&\"・\"&J638&\"・\"&K638&\"・\"&L638&\"・\"&M638&\"・\"&N638))))))","v":""},"","","","",""]
[null,{"$f":"データリスト!AK$46","v":"その他1"},{"$f":"IF(データリスト!AK57=\"\",\"\",データリスト!AK57)","v":""},{"$nulls":17},{"$f":"IF(I639:N639=\"\",\"\",IF(J639:N639=\"\",I639,IF(K639:N639=\"\",I639&\"・\"&J639,IF(L639:N639=\"\",I639&\"・\"&J639&\"・\"&K639,IF(M639:N639=\"\",I639&\"・\"&J639&\"・\"&K639&\"・\"&L639,IF(N639=\"\",I639&\"・\"&J639&\"・\"&K639&\"・\"&L639&\"・\"&M639,I639&\"・\"&J639&\"・\"&K639&\"・\"&L639&\"・\"&M639&\"・\"&N639))))))","v":""},"","","","",""]
[null,{"$f":"データリスト!AK$46","v":"その他1"},{"$f":"IF(データリスト!AK58=\"\",\"\",データリスト!AK58)","v":""},{"$nulls":17},{"$f":"IF(I640:N640=\"\",\"\",IF(J640:N640=\"\",I640,IF(K640:N640=\"\",I640&\"・\"&J640,IF(L640:N640=\"\",I640&\"・\"&J640&\"・\"&K640,IF(M640:N640=\"\",I640&\"・\"&J640&\"・\"&K640&\"・\"&L640,IF(N640=\"\",I640&\"・\"&J640&\"・\"&K640&\"・\"&L640&\"・\"&M640,I640&\"・\"&J640&\"・\"&K640&\"・\"&L640&\"・\"&M640&\"・\"&N640))))))","v":""},"","","","",""]
[null,{"$f":"データリスト!AK$46","v":"その他1"},{"$f":"IF(データリスト!AK59=\"\",\"\",データリスト!AK59)","v":""},{"$nulls":17},{"$f":"IF(I641:N641=\"\",\"\",IF(J641:N641=\"\",I641,IF(K641:N641=\"\",I641&\"・\"&J641,IF(L641:N641=\"\",I641&\"・\"&J641&\"・\"&K641,IF(M641:N641=\"\",I641&\"・\"&J641&\"・\"&K641&\"・\"&L641,IF(N641=\"\",I641&\"・\"&J641&\"・\"&K641&\"・\"&L641&\"・\"&M641,I641&\"・\"&J641&\"・\"&K641&\"・\"&L641&\"・\"&M641&\"・\"&N641))))))","v":""},"","","","",""]
[null,{"$f":"データリスト!AK$46","v":"その他1"},{"$f":"IF(データリスト!AK60=\"\",\"\",データリスト!AK60)","v":""},{"$nulls":17},{"$f":"IF(I642:N642=\"\",\"\",IF(J642:N642=\"\",I642,IF(K642:N642=\"\",I642&\"・\"&J642,IF(L642:N642=\"\",I642&\"・\"&J642&\"・\"&K642,IF(M642:N642=\"\",I642&\"・\"&J642&\"・\"&K642&\"・\"&L642,IF(N642=\"\",I642&\"・\"&J642&\"・\"&K642&\"・\"&L642&\"・\"&M642,I642&\"・\"&J642&\"・\"&K642&\"・\"&L642&\"・\"&M642&\"・\"&N642))))))","v":""},"","","","",""]
[null,{"$f":"データリスト!AK$46","v":"その他1"},{"$f":"IF(データリスト!AK61=\"\",\"\",データリスト!AK61)","v":""},{"$nulls":17},{"$f":"IF(I643:N643=\"\",\"\",IF(J643:N643=\"\",I643,IF(K643:N643=\"\",I643&\"・\"&J643,IF(L643:N643=\"\",I643&\"・\"&J643&\"・\"&K643,IF(M643:N643=\"\",I643&\"・\"&J643&\"・\"&K643&\"・\"&L643,IF(N643=\"\",I643&\"・\"&J643&\"・\"&K643&\"・\"&L643&\"・\"&M643,I643&\"・\"&J643&\"・\"&K643&\"・\"&L643&\"・\"&M643&\"・\"&N643))))))","v":""},"","","","",""]
[null,{"$f":"データリスト!AK$46","v":"その他1"},{"$f":"IF(データリスト!AK62=\"\",\"\",データリスト!AK62)","v":""},{"$nulls":17},{"$f":"IF(I644:N644=\"\",\"\",IF(J644:N644=\"\",I644,IF(K644:N644=\"\",I644&\"・\"&J644,IF(L644:N644=\"\",I644&\"・\"&J644&\"・\"&K644,IF(M644:N644=\"\",I644&\"・\"&J644&\"・\"&K644&\"・\"&L644,IF(N644=\"\",I644&\"・\"&J644&\"・\"&K644&\"・\"&L644&\"・\"&M644,I644&\"・\"&J644&\"・\"&K644&\"・\"&L644&\"・\"&M644&\"・\"&N644))))))","v":""},"","","","",""]
[null,{"$f":"データリスト!AK$46","v":"その他1"},{"$f":"IF(データリスト!AK63=\"\",\"\",データリスト!AK63)","v":""},{"$nulls":17},{"$f":"IF(I645:N645=\"\",\"\",IF(J645:N645=\"\",I645,IF(K645:N645=\"\",I645&\"・\"&J645,IF(L645:N645=\"\",I645&\"・\"&J645&\"・\"&K645,IF(M645:N645=\"\",I645&\"・\"&J645&\"・\"&K645&\"・\"&L645,IF(N645=\"\",I645&\"・\"&J645&\"・\"&K645&\"・\"&L645&\"・\"&M645,I645&\"・\"&J645&\"・\"&K645&\"・\"&L645&\"・\"&M645&\"・\"&N645))))))","v":""},"","","","",""]
[null,{"$f":"データリスト!AK$46","v":"その他1"},{"$f":"IF(データリスト!AK64=\"\",\"\",データリスト!AK64)","v":""},{"$nulls":17},{"$f":"IF(I646:N646=\"\",\"\",IF(J646:N646=\"\",I646,IF(K646:N646=\"\",I646&\"・\"&J646,IF(L646:N646=\"\",I646&\"・\"&J646&\"・\"&K646,IF(M646:N646=\"\",I646&\"・\"&J646&\"・\"&K646&\"・\"&L646,IF(N646=\"\",I646&\"・\"&J646&\"・\"&K646&\"・\"&L646&\"・\"&M646,I646&\"・\"&J646&\"・\"&K646&\"・\"&L646&\"・\"&M646&\"・\"&N646))))))","v":""},"","","","",""]
[null,{"$f":"データリスト!AK$46","v":"その他1"},{"$f":"IF(データリスト!AK65=\"\",\"\",データリスト!AK65)","v":""},{"$nulls":17},{"$f":"IF(I647:N647=\"\",\"\",IF(J647:N647=\"\",I647,IF(K647:N647=\"\",I647&\"・\"&J647,IF(L647:N647=\"\",I647&\"・\"&J647&\"・\"&K647,IF(M647:N647=\"\",I647&\"・\"&J647&\"・\"&K647&\"・\"&L647,IF(N647=\"\",I647&\"・\"&J647&\"・\"&K647&\"・\"&L647&\"・\"&M647,I647&\"・\"&J647&\"・\"&K647&\"・\"&L647&\"・\"&M647&\"・\"&N647))))))","v":""},"","","","",""]
[null,{"$f":"データリスト!AK$46","v":"その他1"},{"$f":"IF(データリスト!AK66=\"\",\"\",データリスト!AK66)","v":""},{"$nulls":17},{"$f":"IF(I648:N648=\"\",\"\",IF(J648:N648=\"\",I648,IF(K648:N648=\"\",I648&\"・\"&J648,IF(L648:N648=\"\",I648&\"・\"&J648&\"・\"&K648,IF(M648:N648=\"\",I648&\"・\"&J648&\"・\"&K648&\"・\"&L648,IF(N648=\"\",I648&\"・\"&J648&\"・\"&K648&\"・\"&L648&\"・\"&M648,I648&\"・\"&J648&\"・\"&K648&\"・\"&L648&\"・\"&M648&\"・\"&N648))))))","v":""},"","","","",""]
[null,{"$f":"データリスト!AL$46","v":"その他2"},{"$f":"IF(データリスト!AL47=\"\",\"\",データリスト!AL47)","v":""},{"$nulls":17},{"$f":"IF(I649:N649=\"\",\"\",IF(J649:N649=\"\",I649,IF(K649:N649=\"\",I649&\"・\"&J649,IF(L649:N649=\"\",I649&\"・\"&J649&\"・\"&K649,IF(M649:N649=\"\",I649&\"・\"&J649&\"・\"&K649&\"・\"&L649,IF(N649=\"\",I649&\"・\"&J649&\"・\"&K649&\"・\"&L649&\"・\"&M649,I649&\"・\"&J649&\"・\"&K649&\"・\"&L649&\"・\"&M649&\"・\"&N649))))))","v":""},"","","","",""]
[null,{"$f":"データリスト!AL$46","v":"その他2"},{"$f":"IF(データリスト!AL48=\"\",\"\",データリスト!AL48)","v":""},{"$nulls":17},{"$f":"IF(I650:N650=\"\",\"\",IF(J650:N650=\"\",I650,IF(K650:N650=\"\",I650&\"・\"&J650,IF(L650:N650=\"\",I650&\"・\"&J650&\"・\"&K650,IF(M650:N650=\"\",I650&\"・\"&J650&\"・\"&K650&\"・\"&L650,IF(N650=\"\",I650&\"・\"&J650&\"・\"&K650&\"・\"&L650&\"・\"&M650,I650&\"・\"&J650&\"・\"&K650&\"・\"&L650&\"・\"&M650&\"・\"&N650))))))","v":""},"","","","",""]
[null,{"$f":"データリスト!AL$46","v":"その他2"},{"$f":"IF(データリスト!AL49=\"\",\"\",データリスト!AL49)","v":""},{"$nulls":17},{"$f":"IF(I651:N651=\"\",\"\",IF(J651:N651=\"\",I651,IF(K651:N651=\"\",I651&\"・\"&J651,IF(L651:N651=\"\",I651&\"・\"&J651&\"・\"&K651,IF(M651:N651=\"\",I651&\"・\"&J651&\"・\"&K651&\"・\"&L651,IF(N651=\"\",I651&\"・\"&J651&\"・\"&K651&\"・\"&L651&\"・\"&M651,I651&\"・\"&J651&\"・\"&K651&\"・\"&L651&\"・\"&M651&\"・\"&N651))))))","v":""},"","","","",""]
[null,{"$f":"データリスト!AL$46","v":"その他2"},{"$f":"IF(データリスト!AL50=\"\",\"\",データリスト!AL50)","v":""},{"$nulls":17},{"$f":"IF(I652:N652=\"\",\"\",IF(J652:N652=\"\",I652,IF(K652:N652=\"\",I652&\"・\"&J652,IF(L652:N652=\"\",I652&\"・\"&J652&\"・\"&K652,IF(M652:N652=\"\",I652&\"・\"&J652&\"・\"&K652&\"・\"&L652,IF(N652=\"\",I652&\"・\"&J652&\"・\"&K652&\"・\"&L652&\"・\"&M652,I652&\"・\"&J652&\"・\"&K652&\"・\"&L652&\"・\"&M652&\"・\"&N652))))))","v":""},"","","","",""]
[null,{"$f":"データリスト!AL$46","v":"その他2"},{"$f":"IF(データリスト!AL51=\"\",\"\",データリスト!AL51)","v":""},{"$nulls":17},{"$f":"IF(I653:N653=\"\",\"\",IF(J653:N653=\"\",I653,IF(K653:N653=\"\",I653&\"・\"&J653,IF(L653:N653=\"\",I653&\"・\"&J653&\"・\"&K653,IF(M653:N653=\"\",I653&\"・\"&J653&\"・\"&K653&\"・\"&L653,IF(N653=\"\",I653&\"・\"&J653&\"・\"&K653&\"・\"&L653&\"・\"&M653,I653&\"・\"&J653&\"・\"&K653&\"・\"&L653&\"・\"&M653&\"・\"&N653))))))","v":""},"","","","",""]
[null,{"$f":"データリスト!AL$46","v":"その他2"},{"$f":"IF(データリスト!AL52=\"\",\"\",データリスト!AL52)","v":""},{"$nulls":17},{"$f":"IF(I654:N654=\"\",\"\",IF(J654:N654=\"\",I654,IF(K654:N654=\"\",I654&\"・\"&J654,IF(L654:N654=\"\",I654&\"・\"&J654&\"・\"&K654,IF(M654:N654=\"\",I654&\"・\"&J654&\"・\"&K654&\"・\"&L654,IF(N654=\"\",I654&\"・\"&J654&\"・\"&K654&\"・\"&L654&\"・\"&M654,I654&\"・\"&J654&\"・\"&K654&\"・\"&L654&\"・\"&M654&\"・\"&N654))))))","v":""},"","","","",""]
[null,{"$f":"データリスト!AL$46","v":"その他2"},{"$f":"IF(データリスト!AL53=\"\",\"\",データリスト!AL53)","v":""},{"$nulls":17},{"$f":"IF(I655:N655=\"\",\"\",IF(J655:N655=\"\",I655,IF(K655:N655=\"\",I655&\"・\"&J655,IF(L655:N655=\"\",I655&\"・\"&J655&\"・\"&K655,IF(M655:N655=\"\",I655&\"・\"&J655&\"・\"&K655&\"・\"&L655,IF(N655=\"\",I655&\"・\"&J655&\"・\"&K655&\"・\"&L655&\"・\"&M655,I655&\"・\"&J655&\"・\"&K655&\"・\"&L655&\"・\"&M655&\"・\"&N655))))))","v":""},"","","","",""]
[null,{"$f":"データリスト!AL$46","v":"その他2"},{"$f":"IF(データリスト!AL54=\"\",\"\",データリスト!AL54)","v":""},{"$nulls":17},{"$f":"IF(I656:N656=\"\",\"\",IF(J656:N656=\"\",I656,IF(K656:N656=\"\",I656&\"・\"&J656,IF(L656:N656=\"\",I656&\"・\"&J656&\"・\"&K656,IF(M656:N656=\"\",I656&\"・\"&J656&\"・\"&K656&\"・\"&L656,IF(N656=\"\",I656&\"・\"&J656&\"・\"&K656&\"・\"&L656&\"・\"&M656,I656&\"・\"&J656&\"・\"&K656&\"・\"&L656&\"・\"&M656&\"・\"&N656))))))","v":""},"","","","",""]
[null,{"$f":"データリスト!AL$46","v":"その他2"},{"$f":"IF(データリスト!AL55=\"\",\"\",データリスト!AL55)","v":""},{"$nulls":17},{"$f":"IF(I657:N657=\"\",\"\",IF(J657:N657=\"\",I657,IF(K657:N657=\"\",I657&\"・\"&J657,IF(L657:N657=\"\",I657&\"・\"&J657&\"・\"&K657,IF(M657:N657=\"\",I657&\"・\"&J657&\"・\"&K657&\"・\"&L657,IF(N657=\"\",I657&\"・\"&J657&\"・\"&K657&\"・\"&L657&\"・\"&M657,I657&\"・\"&J657&\"・\"&K657&\"・\"&L657&\"・\"&M657&\"・\"&N657))))))","v":""},"","","","",""]
[null,{"$f":"データリスト!AL$46","v":"その他2"},{"$f":"IF(データリスト!AL56=\"\",\"\",データリスト!AL56)","v":""},{"$nulls":17},{"$f":"IF(I658:N658=\"\",\"\",IF(J658:N658=\"\",I658,IF(K658:N658=\"\",I658&\"・\"&J658,IF(L658:N658=\"\",I658&\"・\"&J658&\"・\"&K658,IF(M658:N658=\"\",I658&\"・\"&J658&\"・\"&K658&\"・\"&L658,IF(N658=\"\",I658&\"・\"&J658&\"・\"&K658&\"・\"&L658&\"・\"&M658,I658&\"・\"&J658&\"・\"&K658&\"・\"&L658&\"・\"&M658&\"・\"&N658))))))","v":""},"","","","",""]
[null,{"$f":"データリスト!AL$46","v":"その他2"},{"$f":"IF(データリスト!AL57=\"\",\"\",データリスト!AL57)","v":""},{"$nulls":17},{"$f":"IF(I659:N659=\"\",\"\",IF(J659:N659=\"\",I659,IF(K659:N659=\"\",I659&\"・\"&J659,IF(L659:N659=\"\",I659&\"・\"&J659&\"・\"&K659,IF(M659:N659=\"\",I659&\"・\"&J659&\"・\"&K659&\"・\"&L659,IF(N659=\"\",I659&\"・\"&J659&\"・\"&K659&\"・\"&L659&\"・\"&M659,I659&\"・\"&J659&\"・\"&K659&\"・\"&L659&\"・\"&M659&\"・\"&N659))))))","v":""},"","","","",""]
[null,{"$f":"データリスト!AL$46","v":"その他2"},{"$f":"IF(データリスト!AL58=\"\",\"\",データリスト!AL58)","v":""},{"$nulls":17},{"$f":"IF(I660:N660=\"\",\"\",IF(J660:N660=\"\",I660,IF(K660:N660=\"\",I660&\"・\"&J660,IF(L660:N660=\"\",I660&\"・\"&J660&\"・\"&K660,IF(M660:N660=\"\",I660&\"・\"&J660&\"・\"&K660&\"・\"&L660,IF(N660=\"\",I660&\"・\"&J660&\"・\"&K660&\"・\"&L660&\"・\"&M660,I660&\"・\"&J660&\"・\"&K660&\"・\"&L660&\"・\"&M660&\"・\"&N660))))))","v":""},"","","","",""]
[null,{"$f":"データリスト!AL$46","v":"その他2"},{"$f":"IF(データリスト!AL59=\"\",\"\",データリスト!AL59)","v":""},{"$nulls":17},{"$f":"IF(I661:N661=\"\",\"\",IF(J661:N661=\"\",I661,IF(K661:N661=\"\",I661&\"・\"&J661,IF(L661:N661=\"\",I661&\"・\"&J661&\"・\"&K661,IF(M661:N661=\"\",I661&\"・\"&J661&\"・\"&K661&\"・\"&L661,IF(N661=\"\",I661&\"・\"&J661&\"・\"&K661&\"・\"&L661&\"・\"&M661,I661&\"・\"&J661&\"・\"&K661&\"・\"&L661&\"・\"&M661&\"・\"&N661))))))","v":""},"","","","",""]
[null,{"$f":"データリスト!AL$46","v":"その他2"},{"$f":"IF(データリスト!AL60=\"\",\"\",データリスト!AL60)","v":""},{"$nulls":17},{"$f":"IF(I662:N662=\"\",\"\",IF(J662:N662=\"\",I662,IF(K662:N662=\"\",I662&\"・\"&J662,IF(L662:N662=\"\",I662&\"・\"&J662&\"・\"&K662,IF(M662:N662=\"\",I662&\"・\"&J662&\"・\"&K662&\"・\"&L662,IF(N662=\"\",I662&\"・\"&J662&\"・\"&K662&\"・\"&L662&\"・\"&M662,I662&\"・\"&J662&\"・\"&K662&\"・\"&L662&\"・\"&M662&\"・\"&N662))))))","v":""},"","","","",""]
[null,{"$f":"データリスト!AL$46","v":"その他2"},{"$f":"IF(データリスト!AL61=\"\",\"\",データリスト!AL61)","v":""},{"$nulls":17},{"$f":"IF(I663:N663=\"\",\"\",IF(J663:N663=\"\",I663,IF(K663:N663=\"\",I663&\"・\"&J663,IF(L663:N663=\"\",I663&\"・\"&J663&\"・\"&K663,IF(M663:N663=\"\",I663&\"・\"&J663&\"・\"&K663&\"・\"&L663,IF(N663=\"\",I663&\"・\"&J663&\"・\"&K663&\"・\"&L663&\"・\"&M663,I663&\"・\"&J663&\"・\"&K663&\"・\"&L663&\"・\"&M663&\"・\"&N663))))))","v":""},"","","","",""]
[null,{"$f":"データリスト!AL$46","v":"その他2"},{"$f":"IF(データリスト!AL62=\"\",\"\",データリスト!AL62)","v":""},{"$nulls":17},{"$f":"IF(I664:N664=\"\",\"\",IF(J664:N664=\"\",I664,IF(K664:N664=\"\",I664&\"・\"&J664,IF(L664:N664=\"\",I664&\"・\"&J664&\"・\"&K664,IF(M664:N664=\"\",I664&\"・\"&J664&\"・\"&K664&\"・\"&L664,IF(N664=\"\",I664&\"・\"&J664&\"・\"&K664&\"・\"&L664&\"・\"&M664,I664&\"・\"&J664&\"・\"&K664&\"・\"&L664&\"・\"&M664&\"・\"&N664))))))","v":""},"","","","",""]
[null,{"$f":"データリスト!AL$46","v":"その他2"},{"$f":"IF(データリスト!AL63=\"\",\"\",データリスト!AL63)","v":""},{"$nulls":17},{"$f":"IF(I665:N665=\"\",\"\",IF(J665:N665=\"\",I665,IF(K665:N665=\"\",I665&\"・\"&J665,IF(L665:N665=\"\",I665&\"・\"&J665&\"・\"&K665,IF(M665:N665=\"\",I665&\"・\"&J665&\"・\"&K665&\"・\"&L665,IF(N665=\"\",I665&\"・\"&J665&\"・\"&K665&\"・\"&L665&\"・\"&M665,I665&\"・\"&J665&\"・\"&K665&\"・\"&L665&\"・\"&M665&\"・\"&N665))))))","v":""},"","","","",""]
[null,{"$f":"データリスト!AL$46","v":"その他2"},{"$f":"IF(データリスト!AL64=\"\",\"\",データリスト!AL64)","v":""},{"$nulls":17},{"$f":"IF(I666:N666=\"\",\"\",IF(J666:N666=\"\",I666,IF(K666:N666=\"\",I666&\"・\"&J666,IF(L666:N666=\"\",I666&\"・\"&J666&\"・\"&K666,IF(M666:N666=\"\",I666&\"・\"&J666&\"・\"&K666&\"・\"&L666,IF(N666=\"\",I666&\"・\"&J666&\"・\"&K666&\"・\"&L666&\"・\"&M666,I666&\"・\"&J666&\"・\"&K666&\"・\"&L666&\"・\"&M666&\"・\"&N666))))))","v":""},"","","","",""]
[null,{"$f":"データリスト!AL$46","v":"その他2"},{"$f":"IF(データリスト!AL65=\"\",\"\",データリスト!AL65)","v":""},{"$nulls":17},{"$f":"IF(I667:N667=\"\",\"\",IF(J667:N667=\"\",I667,IF(K667:N667=\"\",I667&\"・\"&J667,IF(L667:N667=\"\",I667&\"・\"&J667&\"・\"&K667,IF(M667:N667=\"\",I667&\"・\"&J667&\"・\"&K667&\"・\"&L667,IF(N667=\"\",I667&\"・\"&J667&\"・\"&K667&\"・\"&L667&\"・\"&M667,I667&\"・\"&J667&\"・\"&K667&\"・\"&L667&\"・\"&M667&\"・\"&N667))))))","v":""},"","","","",""]
[null,{"$f":"データリスト!AL$46","v":"その他2"},{"$f":"IF(データリスト!AL66=\"\",\"\",データリスト!AL66)","v":""},{"$nulls":17},{"$f":"IF(I668:N668=\"\",\"\",IF(J668:N668=\"\",I668,IF(K668:N668=\"\",I668&\"・\"&J668,IF(L668:N668=\"\",I668&\"・\"&J668&\"・\"&K668,IF(M668:N668=\"\",I668&\"・\"&J668&\"・\"&K668&\"・\"&L668,IF(N668=\"\",I668&\"・\"&J668&\"・\"&K668&\"・\"&L668&\"・\"&M668,I668&\"・\"&J668&\"・\"&K668&\"・\"&L668&\"・\"&M668&\"・\"&N668))))))","v":""},"","","","",""]
[null,{"$f":"データリスト!AM$46","v":"その他3"},{"$f":"IF(データリスト!AM47=\"\",\"\",データリスト!AM47)","v":""},{"$nulls":17},{"$f":"IF(I669:N669=\"\",\"\",IF(J669:N669=\"\",I669,IF(K669:N669=\"\",I669&\"・\"&J669,IF(L669:N669=\"\",I669&\"・\"&J669&\"・\"&K669,IF(M669:N669=\"\",I669&\"・\"&J669&\"・\"&K669&\"・\"&L669,IF(N669=\"\",I669&\"・\"&J669&\"・\"&K669&\"・\"&L669&\"・\"&M669,I669&\"・\"&J669&\"・\"&K669&\"・\"&L669&\"・\"&M669&\"・\"&N669))))))","v":""},"","","","",""]
[null,{"$f":"データリスト!AM$46","v":"その他3"},{"$f":"IF(データリスト!AM48=\"\",\"\",データリスト!AM48)","v":""},{"$nulls":17},{"$f":"IF(I670:N670=\"\",\"\",IF(J670:N670=\"\",I670,IF(K670:N670=\"\",I670&\"・\"&J670,IF(L670:N670=\"\",I670&\"・\"&J670&\"・\"&K670,IF(M670:N670=\"\",I670&\"・\"&J670&\"・\"&K670&\"・\"&L670,IF(N670=\"\",I670&\"・\"&J670&\"・\"&K670&\"・\"&L670&\"・\"&M670,I670&\"・\"&J670&\"・\"&K670&\"・\"&L670&\"・\"&M670&\"・\"&N670))))))","v":""},"","","","",""]
[null,{"$f":"データリスト!AM$46","v":"その他3"},{"$f":"IF(データリスト!AM49=\"\",\"\",データリスト!AM49)","v":""},{"$nulls":17},{"$f":"IF(I671:N671=\"\",\"\",IF(J671:N671=\"\",I671,IF(K671:N671=\"\",I671&\"・\"&J671,IF(L671:N671=\"\",I671&\"・\"&J671&\"・\"&K671,IF(M671:N671=\"\",I671&\"・\"&J671&\"・\"&K671&\"・\"&L671,IF(N671=\"\",I671&\"・\"&J671&\"・\"&K671&\"・\"&L671&\"・\"&M671,I671&\"・\"&J671&\"・\"&K671&\"・\"&L671&\"・\"&M671&\"・\"&N671))))))","v":""},"","","","",""]
[null,{"$f":"データリスト!AM$46","v":"その他3"},{"$f":"IF(データリスト!AM50=\"\",\"\",データリスト!AM50)","v":""},{"$nulls":17},{"$f":"IF(I672:N672=\"\",\"\",IF(J672:N672=\"\",I672,IF(K672:N672=\"\",I672&\"・\"&J672,IF(L672:N672=\"\",I672&\"・\"&J672&\"・\"&K672,IF(M672:N672=\"\",I672&\"・\"&J672&\"・\"&K672&\"・\"&L672,IF(N672=\"\",I672&\"・\"&J672&\"・\"&K672&\"・\"&L672&\"・\"&M672,I672&\"・\"&J672&\"・\"&K672&\"・\"&L672&\"・\"&M672&\"・\"&N672))))))","v":""},"","","","",""]
[null,{"$f":"データリスト!AM$46","v":"その他3"},{"$f":"IF(データリスト!AM51=\"\",\"\",データリスト!AM51)","v":""},{"$nulls":17},{"$f":"IF(I673:N673=\"\",\"\",IF(J673:N673=\"\",I673,IF(K673:N673=\"\",I673&\"・\"&J673,IF(L673:N673=\"\",I673&\"・\"&J673&\"・\"&K673,IF(M673:N673=\"\",I673&\"・\"&J673&\"・\"&K673&\"・\"&L673,IF(N673=\"\",I673&\"・\"&J673&\"・\"&K673&\"・\"&L673&\"・\"&M673,I673&\"・\"&J673&\"・\"&K673&\"・\"&L673&\"・\"&M673&\"・\"&N673))))))","v":""},"","","","",""]
[null,{"$f":"データリスト!AM$46","v":"その他3"},{"$f":"IF(データリスト!AM52=\"\",\"\",データリスト!AM52)","v":""},{"$nulls":17},{"$f":"IF(I674:N674=\"\",\"\",IF(J674:N674=\"\",I674,IF(K674:N674=\"\",I674&\"・\"&J674,IF(L674:N674=\"\",I674&\"・\"&J674&\"・\"&K674,IF(M674:N674=\"\",I674&\"・\"&J674&\"・\"&K674&\"・\"&L674,IF(N674=\"\",I674&\"・\"&J674&\"・\"&K674&\"・\"&L674&\"・\"&M674,I674&\"・\"&J674&\"・\"&K674&\"・\"&L674&\"・\"&M674&\"・\"&N674))))))","v":""},"","","","",""]
[null,{"$f":"データリスト!AM$46","v":"その他3"},{"$f":"IF(データリスト!AM53=\"\",\"\",データリスト!AM53)","v":""},{"$nulls":17},{"$f":"IF(I675:N675=\"\",\"\",IF(J675:N675=\"\",I675,IF(K675:N675=\"\",I675&\"・\"&J675,IF(L675:N675=\"\",I675&\"・\"&J675&\"・\"&K675,IF(M675:N675=\"\",I675&\"・\"&J675&\"・\"&K675&\"・\"&L675,IF(N675=\"\",I675&\"・\"&J675&\"・\"&K675&\"・\"&L675&\"・\"&M675,I675&\"・\"&J675&\"・\"&K675&\"・\"&L675&\"・\"&M675&\"・\"&N675))))))","v":""},"","","","",""]
[null,{"$f":"データリスト!AM$46","v":"その他3"},{"$f":"IF(データリスト!AM54=\"\",\"\",データリスト!AM54)","v":""},{"$nulls":17},{"$f":"IF(I676:N676=\"\",\"\",IF(J676:N676=\"\",I676,IF(K676:N676=\"\",I676&\"・\"&J676,IF(L676:N676=\"\",I676&\"・\"&J676&\"・\"&K676,IF(M676:N676=\"\",I676&\"・\"&J676&\"・\"&K676&\"・\"&L676,IF(N676=\"\",I676&\"・\"&J676&\"・\"&K676&\"・\"&L676&\"・\"&M676,I676&\"・\"&J676&\"・\"&K676&\"・\"&L676&\"・\"&M676&\"・\"&N676))))))","v":""},"","","","",""]
[null,{"$f":"データリスト!AM$46","v":"その他3"},{"$f":"IF(データリスト!AM55=\"\",\"\",データリスト!AM55)","v":""},{"$nulls":17},{"$f":"IF(I677:N677=\"\",\"\",IF(J677:N677=\"\",I677,IF(K677:N677=\"\",I677&\"・\"&J677,IF(L677:N677=\"\",I677&\"・\"&J677&\"・\"&K677,IF(M677:N677=\"\",I677&\"・\"&J677&\"・\"&K677&\"・\"&L677,IF(N677=\"\",I677&\"・\"&J677&\"・\"&K677&\"・\"&L677&\"・\"&M677,I677&\"・\"&J677&\"・\"&K677&\"・\"&L677&\"・\"&M677&\"・\"&N677))))))","v":""},"","","","",""]
[null,{"$f":"データリスト!AM$46","v":"その他3"},{"$f":"IF(データリスト!AM56=\"\",\"\",データリスト!AM56)","v":""},{"$nulls":17},{"$f":"IF(I678:N678=\"\",\"\",IF(J678:N678=\"\",I678,IF(K678:N678=\"\",I678&\"・\"&J678,IF(L678:N678=\"\",I678&\"・\"&J678&\"・\"&K678,IF(M678:N678=\"\",I678&\"・\"&J678&\"・\"&K678&\"・\"&L678,IF(N678=\"\",I678&\"・\"&J678&\"・\"&K678&\"・\"&L678&\"・\"&M678,I678&\"・\"&J678&\"・\"&K678&\"・\"&L678&\"・\"&M678&\"・\"&N678))))))","v":""},"","","","",""]
[null,{"$f":"データリスト!AM$46","v":"その他3"},{"$f":"IF(データリスト!AM57=\"\",\"\",データリスト!AM57)","v":""},{"$nulls":17},{"$f":"IF(I679:N679=\"\",\"\",IF(J679:N679=\"\",I679,IF(K679:N679=\"\",I679&\"・\"&J679,IF(L679:N679=\"\",I679&\"・\"&J679&\"・\"&K679,IF(M679:N679=\"\",I679&\"・\"&J679&\"・\"&K679&\"・\"&L679,IF(N679=\"\",I679&\"・\"&J679&\"・\"&K679&\"・\"&L679&\"・\"&M679,I679&\"・\"&J679&\"・\"&K679&\"・\"&L679&\"・\"&M679&\"・\"&N679))))))","v":""},"","","","",""]
[null,{"$f":"データリスト!AM$46","v":"その他3"},{"$f":"IF(データリスト!AM58=\"\",\"\",データリスト!AM58)","v":""},{"$nulls":17},{"$f":"IF(I680:N680=\"\",\"\",IF(J680:N680=\"\",I680,IF(K680:N680=\"\",I680&\"・\"&J680,IF(L680:N680=\"\",I680&\"・\"&J680&\"・\"&K680,IF(M680:N680=\"\",I680&\"・\"&J680&\"・\"&K680&\"・\"&L680,IF(N680=\"\",I680&\"・\"&J680&\"・\"&K680&\"・\"&L680&\"・\"&M680,I680&\"・\"&J680&\"・\"&K680&\"・\"&L680&\"・\"&M680&\"・\"&N680))))))","v":""},"","","","",""]
[null,{"$f":"データリスト!AM$46","v":"その他3"},{"$f":"IF(データリスト!AM59=\"\",\"\",データリスト!AM59)","v":""},{"$nulls":17},{"$f":"IF(I681:N681=\"\",\"\",IF(J681:N681=\"\",I681,IF(K681:N681=\"\",I681&\"・\"&J681,IF(L681:N681=\"\",I681&\"・\"&J681&\"・\"&K681,IF(M681:N681=\"\",I681&\"・\"&J681&\"・\"&K681&\"・\"&L681,IF(N681=\"\",I681&\"・\"&J681&\"・\"&K681&\"・\"&L681&\"・\"&M681,I681&\"・\"&J681&\"・\"&K681&\"・\"&L681&\"・\"&M681&\"・\"&N681))))))","v":""},"","","","",""]
[null,{"$f":"データリスト!AM$46","v":"その他3"},{"$f":"IF(データリスト!AM60=\"\",\"\",データリスト!AM60)","v":""},{"$nulls":17},{"$f":"IF(I682:N682=\"\",\"\",IF(J682:N682=\"\",I682,IF(K682:N682=\"\",I682&\"・\"&J682,IF(L682:N682=\"\",I682&\"・\"&J682&\"・\"&K682,IF(M682:N682=\"\",I682&\"・\"&J682&\"・\"&K682&\"・\"&L682,IF(N682=\"\",I682&\"・\"&J682&\"・\"&K682&\"・\"&L682&\"・\"&M682,I682&\"・\"&J682&\"・\"&K682&\"・\"&L682&\"・\"&M682&\"・\"&N682))))))","v":""},"","","","",""]
[null,{"$f":"データリスト!AM$46","v":"その他3"},{"$f":"IF(データリスト!AM61=\"\",\"\",データリスト!AM61)","v":""},{"$nulls":17},{"$f":"IF(I683:N683=\"\",\"\",IF(J683:N683=\"\",I683,IF(K683:N683=\"\",I683&\"・\"&J683,IF(L683:N683=\"\",I683&\"・\"&J683&\"・\"&K683,IF(M683:N683=\"\",I683&\"・\"&J683&\"・\"&K683&\"・\"&L683,IF(N683=\"\",I683&\"・\"&J683&\"・\"&K683&\"・\"&L683&\"・\"&M683,I683&\"・\"&J683&\"・\"&K683&\"・\"&L683&\"・\"&M683&\"・\"&N683))))))","v":""},"","","","",""]
[null,{"$f":"データリスト!AM$46","v":"その他3"},{"$f":"IF(データリスト!AM62=\"\",\"\",データリスト!AM62)","v":""},{"$nulls":17},{"$f":"IF(I684:N684=\"\",\"\",IF(J684:N684=\"\",I684,IF(K684:N684=\"\",I684&\"・\"&J684,IF(L684:N684=\"\",I684&\"・\"&J684&\"・\"&K684,IF(M684:N684=\"\",I684&\"・\"&J684&\"・\"&K684&\"・\"&L684,IF(N684=\"\",I684&\"・\"&J684&\"・\"&K684&\"・\"&L684&\"・\"&M684,I684&\"・\"&J684&\"・\"&K684&\"・\"&L684&\"・\"&M684&\"・\"&N684))))))","v":""},"","","","",""]
[null,{"$f":"データリスト!AM$46","v":"その他3"},{"$f":"IF(データリスト!AM63=\"\",\"\",データリスト!AM63)","v":""},{"$nulls":17},{"$f":"IF(I685:N685=\"\",\"\",IF(J685:N685=\"\",I685,IF(K685:N685=\"\",I685&\"・\"&J685,IF(L685:N685=\"\",I685&\"・\"&J685&\"・\"&K685,IF(M685:N685=\"\",I685&\"・\"&J685&\"・\"&K685&\"・\"&L685,IF(N685=\"\",I685&\"・\"&J685&\"・\"&K685&\"・\"&L685&\"・\"&M685,I685&\"・\"&J685&\"・\"&K685&\"・\"&L685&\"・\"&M685&\"・\"&N685))))))","v":""},"","","","",""]
[null,{"$f":"データリスト!AM$46","v":"その他3"},{"$f":"IF(データリスト!AM64=\"\",\"\",データリスト!AM64)","v":""},{"$nulls":17},{"$f":"IF(I686:N686=\"\",\"\",IF(J686:N686=\"\",I686,IF(K686:N686=\"\",I686&\"・\"&J686,IF(L686:N686=\"\",I686&\"・\"&J686&\"・\"&K686,IF(M686:N686=\"\",I686&\"・\"&J686&\"・\"&K686&\"・\"&L686,IF(N686=\"\",I686&\"・\"&J686&\"・\"&K686&\"・\"&L686&\"・\"&M686,I686&\"・\"&J686&\"・\"&K686&\"・\"&L686&\"・\"&M686&\"・\"&N686))))))","v":""},"","","","",""]
[null,{"$f":"データリスト!AM$46","v":"その他3"},{"$f":"IF(データリスト!AM65=\"\",\"\",データリスト!AM65)","v":""},{"$nulls":17},{"$f":"IF(I687:N687=\"\",\"\",IF(J687:N687=\"\",I687,IF(K687:N687=\"\",I687&\"・\"&J687,IF(L687:N687=\"\",I687&\"・\"&J687&\"・\"&K687,IF(M687:N687=\"\",I687&\"・\"&J687&\"・\"&K687&\"・\"&L687,IF(N687=\"\",I687&\"・\"&J687&\"・\"&K687&\"・\"&L687&\"・\"&M687,I687&\"・\"&J687&\"・\"&K687&\"・\"&L687&\"・\"&M687&\"・\"&N687))))))","v":""},"","","","",""]
[null,{"$f":"データリスト!AM$46","v":"その他3"},{"$f":"IF(データリスト!AM66=\"\",\"\",データリスト!AM66)","v":""},{"$nulls":17},{"$f":"IF(I688:N688=\"\",\"\",IF(J688:N688=\"\",I688,IF(K688:N688=\"\",I688&\"・\"&J688,IF(L688:N688=\"\",I688&\"・\"&J688&\"・\"&K688,IF(M688:N688=\"\",I688&\"・\"&J688&\"・\"&K688&\"・\"&L688,IF(N688=\"\",I688&\"・\"&J688&\"・\"&K688&\"・\"&L688&\"・\"&M688,I688&\"・\"&J688&\"・\"&K688&\"・\"&L688&\"・\"&M688&\"・\"&N688))))))","v":""},"","","","",""]
[null,{"$f":"データリスト!AN$46","v":"その他4"},{"$f":"IF(データリスト!AN47=\"\",\"\",データリスト!AN47)","v":""},{"$nulls":17},{"$f":"IF(I689:N689=\"\",\"\",IF(J689:N689=\"\",I689,IF(K689:N689=\"\",I689&\"・\"&J689,IF(L689:N689=\"\",I689&\"・\"&J689&\"・\"&K689,IF(M689:N689=\"\",I689&\"・\"&J689&\"・\"&K689&\"・\"&L689,IF(N689=\"\",I689&\"・\"&J689&\"・\"&K689&\"・\"&L689&\"・\"&M689,I689&\"・\"&J689&\"・\"&K689&\"・\"&L689&\"・\"&M689&\"・\"&N689))))))","v":""},"","","","",""]
[null,{"$f":"データリスト!AN$46","v":"その他4"},{"$f":"IF(データリスト!AN48=\"\",\"\",データリスト!AN48)","v":""},{"$nulls":17},{"$f":"IF(I690:N690=\"\",\"\",IF(J690:N690=\"\",I690,IF(K690:N690=\"\",I690&\"・\"&J690,IF(L690:N690=\"\",I690&\"・\"&J690&\"・\"&K690,IF(M690:N690=\"\",I690&\"・\"&J690&\"・\"&K690&\"・\"&L690,IF(N690=\"\",I690&\"・\"&J690&\"・\"&K690&\"・\"&L690&\"・\"&M690,I690&\"・\"&J690&\"・\"&K690&\"・\"&L690&\"・\"&M690&\"・\"&N690))))))","v":""},"","","","",""]
[null,{"$f":"データリスト!AN$46","v":"その他4"},{"$f":"IF(データリスト!AN49=\"\",\"\",データリスト!AN49)","v":""},{"$nulls":17},{"$f":"IF(I691:N691=\"\",\"\",IF(J691:N691=\"\",I691,IF(K691:N691=\"\",I691&\"・\"&J691,IF(L691:N691=\"\",I691&\"・\"&J691&\"・\"&K691,IF(M691:N691=\"\",I691&\"・\"&J691&\"・\"&K691&\"・\"&L691,IF(N691=\"\",I691&\"・\"&J691&\"・\"&K691&\"・\"&L691&\"・\"&M691,I691&\"・\"&J691&\"・\"&K691&\"・\"&L691&\"・\"&M691&\"・\"&N691))))))","v":""},"","","","",""]
[null,{"$f":"データリスト!AN$46","v":"その他4"},{"$f":"IF(データリスト!AN50=\"\",\"\",データリスト!AN50)","v":""},{"$nulls":17},{"$f":"IF(I692:N692=\"\",\"\",IF(J692:N692=\"\",I692,IF(K692:N692=\"\",I692&\"・\"&J692,IF(L692:N692=\"\",I692&\"・\"&J692&\"・\"&K692,IF(M692:N692=\"\",I692&\"・\"&J692&\"・\"&K692&\"・\"&L692,IF(N692=\"\",I692&\"・\"&J692&\"・\"&K692&\"・\"&L692&\"・\"&M692,I692&\"・\"&J692&\"・\"&K692&\"・\"&L692&\"・\"&M692&\"・\"&N692))))))","v":""},"","","","",""]
[null,{"$f":"データリスト!AN$46","v":"その他4"},{"$f":"IF(データリスト!AN51=\"\",\"\",データリスト!AN51)","v":""},{"$nulls":17},{"$f":"IF(I693:N693=\"\",\"\",IF(J693:N693=\"\",I693,IF(K693:N693=\"\",I693&\"・\"&J693,IF(L693:N693=\"\",I693&\"・\"&J693&\"・\"&K693,IF(M693:N693=\"\",I693&\"・\"&J693&\"・\"&K693&\"・\"&L693,IF(N693=\"\",I693&\"・\"&J693&\"・\"&K693&\"・\"&L693&\"・\"&M693,I693&\"・\"&J693&\"・\"&K693&\"・\"&L693&\"・\"&M693&\"・\"&N693))))))","v":""},"","","","",""]
[null,{"$f":"データリスト!AN$46","v":"その他4"},{"$f":"IF(データリスト!AN52=\"\",\"\",データリスト!AN52)","v":""},{"$nulls":17},{"$f":"IF(I694:N694=\"\",\"\",IF(J694:N694=\"\",I694,IF(K694:N694=\"\",I694&\"・\"&J694,IF(L694:N694=\"\",I694&\"・\"&J694&\"・\"&K694,IF(M694:N694=\"\",I694&\"・\"&J694&\"・\"&K694&\"・\"&L694,IF(N694=\"\",I694&\"・\"&J694&\"・\"&K694&\"・\"&L694&\"・\"&M694,I694&\"・\"&J694&\"・\"&K694&\"・\"&L694&\"・\"&M694&\"・\"&N694))))))","v":""},"","","","",""]
[null,{"$f":"データリスト!AN$46","v":"その他4"},{"$f":"IF(データリスト!AN53=\"\",\"\",データリスト!AN53)","v":""},{"$nulls":17},{"$f":"IF(I695:N695=\"\",\"\",IF(J695:N695=\"\",I695,IF(K695:N695=\"\",I695&\"・\"&J695,IF(L695:N695=\"\",I695&\"・\"&J695&\"・\"&K695,IF(M695:N695=\"\",I695&\"・\"&J695&\"・\"&K695&\"・\"&L695,IF(N695=\"\",I695&\"・\"&J695&\"・\"&K695&\"・\"&L695&\"・\"&M695,I695&\"・\"&J695&\"・\"&K695&\"・\"&L695&\"・\"&M695&\"・\"&N695))))))","v":""},"","","","",""]
[null,{"$f":"データリスト!AN$46","v":"その他4"},{"$f":"IF(データリスト!AN54=\"\",\"\",データリスト!AN54)","v":""},{"$nulls":17},{"$f":"IF(I696:N696=\"\",\"\",IF(J696:N696=\"\",I696,IF(K696:N696=\"\",I696&\"・\"&J696,IF(L696:N696=\"\",I696&\"・\"&J696&\"・\"&K696,IF(M696:N696=\"\",I696&\"・\"&J696&\"・\"&K696&\"・\"&L696,IF(N696=\"\",I696&\"・\"&J696&\"・\"&K696&\"・\"&L696&\"・\"&M696,I696&\"・\"&J696&\"・\"&K696&\"・\"&L696&\"・\"&M696&\"・\"&N696))))))","v":""},"","","","",""]
[null,{"$f":"データリスト!AN$46","v":"その他4"},{"$f":"IF(データリスト!AN55=\"\",\"\",データリスト!AN55)","v":""},{"$nulls":17},{"$f":"IF(I697:N697=\"\",\"\",IF(J697:N697=\"\",I697,IF(K697:N697=\"\",I697&\"・\"&J697,IF(L697:N697=\"\",I697&\"・\"&J697&\"・\"&K697,IF(M697:N697=\"\",I697&\"・\"&J697&\"・\"&K697&\"・\"&L697,IF(N697=\"\",I697&\"・\"&J697&\"・\"&K697&\"・\"&L697&\"・\"&M697,I697&\"・\"&J697&\"・\"&K697&\"・\"&L697&\"・\"&M697&\"・\"&N697))))))","v":""},"","","","",""]
[null,{"$f":"データリスト!AN$46","v":"その他4"},{"$f":"IF(データリスト!AN56=\"\",\"\",データリスト!AN56)","v":""},{"$nulls":17},{"$f":"IF(I698:N698=\"\",\"\",IF(J698:N698=\"\",I698,IF(K698:N698=\"\",I698&\"・\"&J698,IF(L698:N698=\"\",I698&\"・\"&J698&\"・\"&K698,IF(M698:N698=\"\",I698&\"・\"&J698&\"・\"&K698&\"・\"&L698,IF(N698=\"\",I698&\"・\"&J698&\"・\"&K698&\"・\"&L698&\"・\"&M698,I698&\"・\"&J698&\"・\"&K698&\"・\"&L698&\"・\"&M698&\"・\"&N698))))))","v":""},"","","","",""]
[null,{"$f":"データリスト!AN$46","v":"その他4"},{"$f":"IF(データリスト!AN57=\"\",\"\",データリスト!AN57)","v":""},{"$nulls":17},{"$f":"IF(I699:N699=\"\",\"\",IF(J699:N699=\"\",I699,IF(K699:N699=\"\",I699&\"・\"&J699,IF(L699:N699=\"\",I699&\"・\"&J699&\"・\"&K699,IF(M699:N699=\"\",I699&\"・\"&J699&\"・\"&K699&\"・\"&L699,IF(N699=\"\",I699&\"・\"&J699&\"・\"&K699&\"・\"&L699&\"・\"&M699,I699&\"・\"&J699&\"・\"&K699&\"・\"&L699&\"・\"&M699&\"・\"&N699))))))","v":""},"","","","",""]
[null,{"$f":"データリスト!AN$46","v":"その他4"},{"$f":"IF(データリスト!AN58=\"\",\"\",データリスト!AN58)","v":""},{"$nulls":17},{"$f":"IF(I700:N700=\"\",\"\",IF(J700:N700=\"\",I700,IF(K700:N700=\"\",I700&\"・\"&J700,IF(L700:N700=\"\",I700&\"・\"&J700&\"・\"&K700,IF(M700:N700=\"\",I700&\"・\"&J700&\"・\"&K700&\"・\"&L700,IF(N700=\"\",I700&\"・\"&J700&\"・\"&K700&\"・\"&L700&\"・\"&M700,I700&\"・\"&J700&\"・\"&K700&\"・\"&L700&\"・\"&M700&\"・\"&N700))))))","v":""},"","","","",""]
[null,{"$f":"データリスト!AN$46","v":"その他4"},{"$f":"IF(データリスト!AN59=\"\",\"\",データリスト!AN59)","v":""},{"$nulls":17},{"$f":"IF(I701:N701=\"\",\"\",IF(J701:N701=\"\",I701,IF(K701:N701=\"\",I701&\"・\"&J701,IF(L701:N701=\"\",I701&\"・\"&J701&\"・\"&K701,IF(M701:N701=\"\",I701&\"・\"&J701&\"・\"&K701&\"・\"&L701,IF(N701=\"\",I701&\"・\"&J701&\"・\"&K701&\"・\"&L701&\"・\"&M701,I701&\"・\"&J701&\"・\"&K701&\"・\"&L701&\"・\"&M701&\"・\"&N701))))))","v":""},"","","","",""]
[null,{"$f":"データリスト!AN$46","v":"その他4"},{"$f":"IF(データリスト!AN60=\"\",\"\",データリスト!AN60)","v":""},{"$nulls":17},{"$f":"IF(I702:N702=\"\",\"\",IF(J702:N702=\"\",I702,IF(K702:N702=\"\",I702&\"・\"&J702,IF(L702:N702=\"\",I702&\"・\"&J702&\"・\"&K702,IF(M702:N702=\"\",I702&\"・\"&J702&\"・\"&K702&\"・\"&L702,IF(N702=\"\",I702&\"・\"&J702&\"・\"&K702&\"・\"&L702&\"・\"&M702,I702&\"・\"&J702&\"・\"&K702&\"・\"&L702&\"・\"&M702&\"・\"&N702))))))","v":""},"","","","",""]
[null,{"$f":"データリスト!AN$46","v":"その他4"},{"$f":"IF(データリスト!AN61=\"\",\"\",データリスト!AN61)","v":""},{"$nulls":17},{"$f":"IF(I703:N703=\"\",\"\",IF(J703:N703=\"\",I703,IF(K703:N703=\"\",I703&\"・\"&J703,IF(L703:N703=\"\",I703&\"・\"&J703&\"・\"&K703,IF(M703:N703=\"\",I703&\"・\"&J703&\"・\"&K703&\"・\"&L703,IF(N703=\"\",I703&\"・\"&J703&\"・\"&K703&\"・\"&L703&\"・\"&M703,I703&\"・\"&J703&\"・\"&K703&\"・\"&L703&\"・\"&M703&\"・\"&N703))))))","v":""},"","","","",""]
[null,{"$f":"データリスト!AN$46","v":"その他4"},{"$f":"IF(データリスト!AN62=\"\",\"\",データリスト!AN62)","v":""},{"$nulls":17},{"$f":"IF(I704:N704=\"\",\"\",IF(J704:N704=\"\",I704,IF(K704:N704=\"\",I704&\"・\"&J704,IF(L704:N704=\"\",I704&\"・\"&J704&\"・\"&K704,IF(M704:N704=\"\",I704&\"・\"&J704&\"・\"&K704&\"・\"&L704,IF(N704=\"\",I704&\"・\"&J704&\"・\"&K704&\"・\"&L704&\"・\"&M704,I704&\"・\"&J704&\"・\"&K704&\"・\"&L704&\"・\"&M704&\"・\"&N704))))))","v":""},"","","","",""]
[null,{"$f":"データリスト!AN$46","v":"その他4"},{"$f":"IF(データリスト!AN63=\"\",\"\",データリスト!AN63)","v":""},{"$nulls":17},{"$f":"IF(I705:N705=\"\",\"\",IF(J705:N705=\"\",I705,IF(K705:N705=\"\",I705&\"・\"&J705,IF(L705:N705=\"\",I705&\"・\"&J705&\"・\"&K705,IF(M705:N705=\"\",I705&\"・\"&J705&\"・\"&K705&\"・\"&L705,IF(N705=\"\",I705&\"・\"&J705&\"・\"&K705&\"・\"&L705&\"・\"&M705,I705&\"・\"&J705&\"・\"&K705&\"・\"&L705&\"・\"&M705&\"・\"&N705))))))","v":""},"","","","",""]
[null,{"$f":"データリスト!AN$46","v":"その他4"},{"$f":"IF(データリスト!AN64=\"\",\"\",データリスト!AN64)","v":""},{"$nulls":17},{"$f":"IF(I706:N706=\"\",\"\",IF(J706:N706=\"\",I706,IF(K706:N706=\"\",I706&\"・\"&J706,IF(L706:N706=\"\",I706&\"・\"&J706&\"・\"&K706,IF(M706:N706=\"\",I706&\"・\"&J706&\"・\"&K706&\"・\"&L706,IF(N706=\"\",I706&\"・\"&J706&\"・\"&K706&\"・\"&L706&\"・\"&M706,I706&\"・\"&J706&\"・\"&K706&\"・\"&L706&\"・\"&M706&\"・\"&N706))))))","v":""},"","","","",""]
[null,{"$f":"データリスト!AN$46","v":"その他4"},{"$f":"IF(データリスト!AN65=\"\",\"\",データリスト!AN65)","v":""},{"$nulls":17},{"$f":"IF(I707:N707=\"\",\"\",IF(J707:N707=\"\",I707,IF(K707:N707=\"\",I707&\"・\"&J707,IF(L707:N707=\"\",I707&\"・\"&J707&\"・\"&K707,IF(M707:N707=\"\",I707&\"・\"&J707&\"・\"&K707&\"・\"&L707,IF(N707=\"\",I707&\"・\"&J707&\"・\"&K707&\"・\"&L707&\"・\"&M707,I707&\"・\"&J707&\"・\"&K707&\"・\"&L707&\"・\"&M707&\"・\"&N707))))))","v":""},"","","","",""]
[null,{"$f":"データリスト!AN$46","v":"その他4"},{"$f":"IF(データリスト!AN66=\"\",\"\",データリスト!AN66)","v":""},{"$nulls":17},{"$f":"IF(I708:N708=\"\",\"\",IF(J708:N708=\"\",I708,IF(K708:N708=\"\",I708&\"・\"&J708,IF(L708:N708=\"\",I708&\"・\"&J708&\"・\"&K708,IF(M708:N708=\"\",I708&\"・\"&J708&\"・\"&K708&\"・\"&L708,IF(N708=\"\",I708&\"・\"&J708&\"・\"&K708&\"・\"&L708&\"・\"&M708,I708&\"・\"&J708&\"・\"&K708&\"・\"&L708&\"・\"&M708&\"・\"&N708))))))","v":""},"","","","",""]
[null,null,{"$f":"IF(データリスト!AN60=\"\",\"\",データリスト!AN60)","v":""}]
[null,null,{"$f":"IF(データリスト!AN61=\"\",\"\",データリスト!AN61)","v":""}]
[null,null,{"$f":"IF(データリスト!AN62=\"\",\"\",データリスト!AN62)","v":""}]
[null,null,{"$f":"IF(データリスト!AN63=\"\",\"\",データリスト!AN63)","v":""}]
[null,null,{"$f":"IF(データリスト!AN64=\"\",\"\",データリスト!AN64)","v":""}]
[null,null,{"$f":"IF(データリスト!AN65=\"\",\"\",データリスト!AN65)","v":""}]
[null,null,{"$f":"IF(データリスト!AN71=\"\",\"\",データリスト!AN71)","v":""}]
[null,null,{"$f":"IF(データリスト!AN72=\"\",\"\",データリスト!AN72)","v":""}]
[null,null,{"$f":"IF(データリスト!AN73=\"\",\"\",データリスト!AN73)","v":""}]
[null,null,{"$f":"IF(データリスト!AM74=\"\",\"\",データリスト!AM74)","v":""}]
[null,null,{"$f":"IF(データリスト!AN75=\"\",\"\",データリスト!AN75)","v":""}]
[null,null,{"$f":"IF(データリスト!AN76=\"\",\"\",データリスト!AN76)","v":""}]
[null,null,{"$f":"IF(データリスト!AN77=\"\",\"\",データリスト!AN77)","v":""}]
[null,null,{"$f":"IF(データリスト!AN71=\"\",\"\",データリスト!AN71)","v":""}]
[null,null,{"$f":"IF(データリスト!AN72=\"\",\"\",データリスト!AN72)","v":""}]
[null,null,{"$f":"IF(データリスト!AN73=\"\",\"\",データリスト!AN73)","v":""}]
[null,null,{"$f":"IF(データリスト!AM74=\"\",\"\",データリスト!AM74)","v":""}]
[null,null,{"$f":"IF(データリスト!AN75=\"\",\"\",データリスト!AN75)","v":""}]
[null,null,{"$f":"IF(データリスト!AN76=\"\",\"\",データリスト!AN76)","v":""}]
[null,null,{"$f":"IF(データリスト!AN84=\"\",\"\",データリスト!AN84)","v":""}]
[null,null,{"$f":"IF(データリスト!AN85=\"\",\"\",データリスト!AN85)","v":""}]
[null,null,{"$f":"IF(データリスト!AN86=\"\",\"\",データリスト!AN86)","v":""}]
[null,null,{"$f":"IF(データリスト!AN87=\"\",\"\",データリスト!AN87)","v":""}]
[null,null,{"$f":"IF(データリスト!AN88=\"\",\"\",データリスト!AN88)","v":""}]
[null,null,{"$f":"IF(データリスト!AN89=\"\",\"\",データリスト!AN89)","v":""}]
[null,null,{"$f":"IF(データリスト!AN90=\"\",\"\",データリスト!AN90)","v":""}]

{"sheet":"年度の予定・記録","index":2,"n_rows":64,"n_cols":56,"rows_kept":64,"merged":[[7,7,7,9],[7,10,7,11],[7,12,7,21],[7,23,7,24],[8,10,8,11],[8,12,8,21]]}
[{"$nulls":49},"科目","総務費","活動調査費","組織活動費","大会費","予備費","合計"]
[{"$nulls":49},"予算",{"$f":"データリスト!F33","v":{"v":37400,"d":"¥37,400"}},{"$f":"データリスト!G33","v":{"v":135000,"d":"¥135,000"}},{"$f":"データリスト!H33","v":{"v":198100,"d":"¥198,100"}},{"$f":"データリスト!I33","v":{"v":16100,"d":"¥16,100"}},{"$f":"データリスト!J33","v":{"v":13618,"d":"¥13,618"}},{"$f":"SUM(AY2:BC2)","v":{"v":400218,"d":"¥400,218"}}]
[{"$nulls":49},"支出額",{"$f":"SUMIF(W9:Y64,AY1,AP9:AP64)","v":0},{"$f":"SUMIF(W9:Y64,AZ1,AP9:AP64)","v":{"v":120000,"d":"¥120,000"}},{"$f":"SUMIF(W9:Y64,BA1,AP9:AP64)","v":{"v":146766,"d":"¥146,766"}},{"$f":"SUMIF(W9:Y64,BB1,AP9:AP64)","v":{"v":12340,"d":"¥12,340"}},{"$f":"SUMIF(W9:Y64,BC1,AP9:AP64)","v":0},{"$f":"SUM(AY3:BC3)","v":{"v":279106,"d":"¥279,106"}}]
[{"$nulls":49},"報告支出額",{"$f":"IF(AY3>AY2,AY2,AY3)","v":0},{"$f":"IF(AZ3>AZ2,AZ2,AZ3)","v":{"v":120000,"d":"¥120,000"}},{"v":146766,"d":"¥146,766"},{"v":12340,"d":"¥12,340"},{"$f":"BC3+BD6","v":0},{"v":279106,"d":"¥279,106"}]
[{"$nulls":49},"収入額",{"$f":"SUMIF(W9:Y64,AY1,AP9:AP64)","v":0},{"$f":"SUMIF(W9:Y64,AZ1,AP9:AP64)","v":{"v":120000,"d":"¥120,000"}},{"$f":"SUMIF(W9:Y64,BA1,AP9:AP64)","v":{"v":146766,"d":"¥146,766"}},{"$f":"SUMIF(W9:Y64,BB1,AP9:AP64)","v":{"v":12340,"d":"¥12,340"}},{"$f":"SUMIF(W9:Y64,BC1,AP9:AP64)","v":0},{"$f":"SUM(AY5:BC5)","v":{"v":279106,"d":"¥279,106"}}]
[{"$nulls":49},"予算超過分",{"$f":"IF(AY3-AY2<0,0,AY3-AY2)","v":0},{"$f":"IF(AZ3-AZ2<0,0,AZ3-AZ2)","v":0},{"$f":"IF(BA3-BA2<0,0,BA3-BA2)","v":0},{"$f":"IF(BB3-BB2<0,0,BB3-BB2)","v":0},{"$f":"IF(BC3-BC2<0,0,BC3-BC2)","v":0},{"$f":"SUM(AY6:BC6)","v":0}]
[{"$nulls":49},"使用率",{"$f":"AY3/AY2","v":{"v":0,"d":"0.0%"}},{"$f":"AZ3/AZ2","v":{"v":0.8888888888888888,"d":"88.9%"}},{"v":0.7408682483594144,"d":"74.1%"},{"$f":"BB3/BB2","v":{"v":0.7664596273291926,"d":"76.6%"}},{"$f":"BC3/BC2","v":{"v":0,"d":"0.0%"}},{"v":0.6973849252157575,"d":"69.7%"}]
[{"$nulls":3},{"$f":"MAX(F9:F64)","v":8},{"$nulls":3},"活動日",null,null,"活動内容",null,"対応者",{"$nulls":9},"出費・収入項目","金額",null,"備考(支出理由等）"]
[{"$nulls":10},"議案書へ表記するものには✔を入れる",{"$nulls":12},"収入額","支出額",null,{"$f":"IF(N9=\"\",M9,M9&\" ・ \"&N9)","v":0},{"$f":"IF(O9=\"\",AA9,AA9&\"  ・\"&O9)","v":0},{"$f":"IF(P9=\"\",AB9,AB9&\"  ・\"&P9)","v":0},{"$f":"IF(Q9=\"\",AC9,AC9&\"  ・\"&Q9)","v":0},{"$f":"IF(R9=\"\",AD9,AD9&\"  ・\"&R9)","v":0},{"$f":"IF(S9=\"\",AE9,AE9&\"  ・\"&S9)","v":0},{"$f":"IF(T9=\"\",AF9,AF9&\"  ・\"&T9)","v":0},{"$f":"IF(U9=\"\",AG9,AG9&\"  ・\"&U9)","v":0},{"$f":"IF(V9=\"\",AH9,AH9&\"  ・\"&V9)","v":0},{"$f":"IF(N9=\"\",M9,IF(O9=\"\",AA9,IF(P9=\"\",AB9,IF(Q9=\"\",AC9,IF(R9=\"\",AD9,IF(S9=\"\",AE9,IF(T9=\"\",AF9,IF(U9=\"\",AG9,IF(V9=\"\",AH9,\"全員\")))))))))","v":0},{"$f":"K9&\"　　　　　　　　　　　　　　　　　　　　　　\"&\"　　　　　　　　　　　　　　　　　　　　　　　　\"&Z9","v":"議案書へ表記するものには✔を入れる　　　　　　　　　　　　　　　　　　　　　　　　　　　　　　　　　　　　　　　　　　　　　　"},{"$f":"IF(H9=H10,AK9&\"　　　　　　　　　　　　　　　　　　　　　　\"&AK10,AK9)","v":"議案書へ表記するものには✔を入れる　　　　　　　　　　　　　　　　　　　　　　　　　　　　　　　　　　　　　　　　　　　　　　"},{"$f":"IF(H9=H11,AL9&\"　　　　　　　　　　　　　　　　　　　　　　　　　　　　\"&AK11,AL9)","v":"議案書へ表記するものには✔を入れる　　　　　　　　　　　　　　　　　　　　　　　　　　　　　　　　　　　　　　　　　　　　　　"},{"$f":"IF(H9=H12,AM9&\"　　　　　　　　　　　　　　　　　　　　　　　　　　\"&AK12,AM9)","v":"議案書へ表記するものには✔を入れる　　　　　　　　　　　　　　　　　　　　　　　　　　　　　　　　　　　　　　　　　　　　　　"},{"$f":"IF(Y9<0,-Y9,0)","v":0},{"$f":"IF(Y9>0,Y9,0)","v":"支出額"}]
[null,{"$f":"COUNTIF($C$9:C10,TRUE)","v":0},false,{"$f":"IF(E10<F10,F10,E10)","v":1},{"$f":"IF(F10<$D$8,0,COUNTIF(F$9:$G10,'2ヶ月カレンダー (2)'!$D$21)+$D$8)","v":0},{"$f":"COUNTIF($G$9:G10,'2ヶ月カレンダー (2)'!$D$20)","v":1},{"$f":"IF(H10=\"\",\"\",TEXT(H10,\"yyyymm\"))","v":"202109"},"2021-09-10",{"$f":"IF(H10=\"\",\"\",\"～\")","v":"～"},"2021-09-10","分会交付金　振込日",null,"C",{"$nulls":9},"分会交付金",{"v":188500,"d":"¥188,500"},0,"本部より交付金入金",{"$f":"IF(N10=\"\",M10,M10&\" ・ \"&N10)","v":"C"},{"$f":"IF(O10=\"\",AA10,AA10&\"  ・\"&O10)","v":"C"},{"$f":"IF(P10=\"\",AB10,AB10&\"  ・\"&P10)","v":"C"},{"$f":"IF(Q10=\"\",AC10,AC10&\"  ・\"&Q10)","v":"C"},{"$f":"IF(R10=\"\",AD10,AD10&\"  ・\"&R10)","v":"C"},{"$f":"IF(S10=\"\",AE10,AE10&\"  ・\"&S10)","v":"C"},{"$f":"IF(T10=\"\",AF10,AF10&\"  ・\"&T10)","v":"C"},{"$f":"IF(U10=\"\",AG10,AG10&\"  ・\"&U10)","v":"C"},{"$f":"IF(V10=\"\",AH10,AH10&\"  ・\"&V10)","v":"C"},{"$f":"IF(N10=\"\",M10,IF(O10=\"\",AA10,IF(P10=\"\",AB10,IF(Q10=\"\",AC10,IF(R10=\"\",AD10,IF(S10=\"\",AE10,IF(T10=\"\",AF10,IF(U10=\"\",AG10,IF(V10=\"\",AH10,\"全員\")))))))))","v":"C"},{"$f":"K10&\"　　　　　　　　　　　　　　　　　　　　　　\"&\"　　　　　　　　　　　　　　　　　　　　　　　　\"&Z10","v":"分会交付金　振込日　　　　　　　　　　　　　　　　　　　　　　　　　　　　　　　　　　　　　　　　　　　　　　本部より交付金入金"},{"$f":"IF(H10=H11,AK10&\"　　　　　　　　　　　　　　　　　　　　　　\"&AK11,AK10)","v":"分会交付金　振込日　　　　　　　　　　　　　　　　　　　　　　　　　　　　　　　　　　　　　　　　　　　　　　本部より交付金入金"},{"$f":"IF(H10=H12,AL10&\"　　　　　　　　　　　　　　　　　　　　　　　　　　　　\"&AK12,AL10)","v":"分会交付金　振込日　　　　　　　　　　　　　　　　　　　　　　　　　　　　　　　　　　　　　　　　　　　　　　本部より交付金入金"},{"$f":"IF(H10=H13,AM10&\"　　　　　　　　　　　　　　　　　　　　　　　　　　\"&AK13,AM10)","v":"分会交付金　振込日　　　　　　　　　　　　　　　　　　　　　　　　　　　　　　　　　　　　　　　　　　　　　　本部より交付金入金"},0,{"$f":"IF(Y10>0,Y10,0)","v":0}]
[null,{"$f":"COUNTIF($C$9:C11,TRUE)","v":1},true,2,{"$f":"IF(F11<$D$8,0,COUNTIF(F$9:$G11,'2ヶ月カレンダー (2)'!$D$21)+$D$8)","v":0},{"$f":"COUNTIF($G$9:G11,'2ヶ月カレンダー (2)'!$D$20)","v":2},"202109","2021-09-12","～","2021-09-12","第1回分会執行委員会",null,"A","B","C","D","E",{"$nulls":5},"組織活動費",null,{"v":6000,"d":"¥6,000"},"食事代（5名分)","A ・ B","A ・ B  ・C","A ・ B  ・C  ・D","A ・ B  ・C  ・D  ・E","A ・ B  ・C  ・D  ・E","A ・ B  ・C  ・D  ・E","A ・ B  ・C  ・D  ・E","A ・ B  ・C  ・D  ・E","A ・ B  ・C  ・D  ・E","A ・ B  ・C  ・D  ・E","第1回分会執行委員会　　　　　　　　　　　　　　　　　　　　　　　　　　　　　　　　　　　　　　　　　　　　　　食事代（5名分)","第1回分会執行委員会　　　　　　　　　　　　　　　　　　　　　　　　　　　　　　　　　　　　　　　　　　　　　　食事代（5名分)","第1回分会執行委員会　　　　　　　　　　　　　　　　　　　　　　　　　　　　　　　　　　　　　　　　　　　　　　食事代（5名分)",{"$f":"IF(H11=H15,AM11&\"　　　　　　　　　　　　　　　　　　　　　　　　　　\"&AK15,AM11)","v":"第1回分会執行委員会　　　　　　　　　　　　　　　　　　　　　　　　　　　　　　　　　　　　　　　　　　　　　　食事代（5名分)"},0,6000]
[null,{"$f":"COUNTIF($C$9:C12,TRUE)","v":2},true,3,{"$f":"IF(F12<$D$8,0,COUNTIF(F$9:$G12,'2ヶ月カレンダー (2)'!$D$21)+$D$8)","v":0},{"$f":"COUNTIF($G$9:G12,'2ヶ月カレンダー (2)'!$D$20)","v":3},"202109","2021-09-14","～","2021-09-14","分会大会",null,"全員",{"$nulls":9},"大会費",null,{"v":12340,"d":"¥12,340"},"会場借用費、コピー用紙代","全員","全員","全員","全員","全員","全員","全員","全員","全員","全員","分会大会　　　　　　　　　　　　　　　　　　　　　　　　　　　　　　　　　　　　　　　　　　　　　　会場借用費、コピー用紙代","分会大会　　　　　　　　　　　　　　　　　　　　　　　　　　　　　　　　　　　　　　　　　　　　　　会場借用費、コピー用紙代　　　　　　　　　　　　　　　　　　　　　　分会大会後　懇親会　　　　　　　　　　　　　　　　　　　　　　　　　　　　　　　　　　　　　　　　　　　　　　懇親会飲食代",{"$f":"IF(H12=H15,AL12&\"　　　　　　　　　　　　　　　　　　　　　　　　　　　　\"&AK15,AL12)","v":"分会大会　　　　　　　　　　　　　　　　　　　　　　　　　　　　　　　　　　　　　　　　　　　　　　会場借用費、コピー用紙代　　　　　　　　　　　　　　　　　　　　　　分会大会後　懇親会　　　　　　　　　　　　　　　　　　　　　　　　　　　　　　　　　　　　　　　　　　　　　　懇親会飲食代"},{"$f":"IF(H12=H16,AM12&\"　　　　　　　　　　　　　　　　　　　　　　　　　　\"&AK16,AM12)","v":"分会大会　　　　　　　　　　　　　　　　　　　　　　　　　　　　　　　　　　　　　　　　　　　　　　会場借用費、コピー用紙代　　　　　　　　　　　　　　　　　　　　　　分会大会後　懇親会　　　　　　　　　　　　　　　　　　　　　　　　　　　　　　　　　　　　　　　　　　　　　　懇親会飲食代"},0,12340]
[null,{"$f":"COUNTIF($C$9:C13,TRUE)","v":2},false,{"$f":"IF(E13<F13,F13,E13)","v":4},{"$f":"IF(F13<$D$8,0,COUNTIF(F$9:$G13,'2ヶ月カレンダー (2)'!$D$21)+$D$8)","v":0},{"$f":"COUNTIF($G$9:G13,'2ヶ月カレンダー (2)'!$D$20)","v":4},"202109","2021-09-14","～","2021-09-14","分会大会後　懇親会",null,"全員",{"$nulls":9},"組織活動費",null,{"v":26970,"d":"¥26,970"},"懇親会飲食代","全員","全員","全員","全員","全員","全員","全員","全員","全員","全員","分会大会後　懇親会　　　　　　　　　　　　　　　　　　　　　　　　　　　　　　　　　　　　　　　　　　　　　　懇親会飲食代",{"$f":"IF(H13=H15,AK13&\"　　　　　　　　　　　　　　　　　　　　　　\"&AK15,AK13)","v":"分会大会後　懇親会　　　　　　　　　　　　　　　　　　　　　　　　　　　　　　　　　　　　　　　　　　　　　　懇親会飲食代"},{"$f":"IF(H13=H16,AL13&\"　　　　　　　　　　　　　　　　　　　　　　　　　　　　\"&AK16,AL13)","v":"分会大会後　懇親会　　　　　　　　　　　　　　　　　　　　　　　　　　　　　　　　　　　　　　　　　　　　　　懇親会飲食代"},{"$f":"IF(H13=H17,AM13&\"　　　　　　　　　　　　　　　　　　　　　　　　　　\"&AK17,AM13)","v":"分会大会後　懇親会　　　　　　　　　　　　　　　　　　　　　　　　　　　　　　　　　　　　　　　　　　　　　　懇親会飲食代"},0,26970]
[null,{"$f":"COUNTIF($C$9:C14,TRUE)","v":2},false,5,{"$f":"IF(F14<$D$8,0,COUNTIF(F$9:$G14,'2ヶ月カレンダー (2)'!$D$21)+$D$8)","v":0},{"$f":"COUNTIF($G$9:G14,'2ヶ月カレンダー (2)'!$D$20)","v":5},{"$f":"IF(H14=\"\",\"\",TEXT(H14,\"yyyymm\"))","v":"202109"},"2021-09-22",{"$f":"IF(H14=\"\",\"\",\"～\")","v":"～"},"2021-09-22","活動調査費支給",null,"執行委員",{"$nulls":9},"活動調査費",null,{"v":60000,"d":"¥60,000"},"6か月分（5名分）",{"$f":"IF(N14=\"\",M14,M14&\" ・ \"&N14)","v":"執行委員"},{"$f":"IF(O14=\"\",AA14,AA14&\"  ・\"&O14)","v":"執行委員"},"執行委員","執行委員","執行委員","執行委員","執行委員","執行委員","執行委員",{"$f":"IF(N14=\"\",M14,IF(O14=\"\",AA14,IF(P14=\"\",AB14,IF(Q14=\"\",AC14,IF(R14=\"\",AD14,IF(S14=\"\",AE14,IF(T14=\"\",AF14,IF(U14=\"\",AG14,IF(V14=\"\",AH14,\"全員\")))))))))","v":"執行委員"},{"$f":"K14&\"　　　　　　　　　　　　　　　　　　　　　　\"&\"　　　　　　　　　　　　　　　　　　　　　　　　\"&Z14","v":"活動調査費支給　　　　　　　　　　　　　　　　　　　　　　　　　　　　　　　　　　　　　　　　　　　　　　6か月分（5名分）"},{"$f":"IF(H14=H29,AK14&\"　　　　　　　　　　　　　　　　　　　　　　\"&AK29,AK14)","v":"活動調査費支給　　　　　　　　　　　　　　　　　　　　　　　　　　　　　　　　　　　　　　　　　　　　　　6か月分（5名分）"},{"$f":"IF(H14=H30,AL14&\"　　　　　　　　　　　　　　　　　　　　　　　　　　　　\"&AK30,AL14)","v":"活動調査費支給　　　　　　　　　　　　　　　　　　　　　　　　　　　　　　　　　　　　　　　　　　　　　　6か月分（5名分）"},{"$f":"IF(H14=H31,AM14&\"　　　　　　　　　　　　　　　　　　　　　　　　　　\"&AK31,AM14)","v":"活動調査費支給　　　　　　　　　　　　　　　　　　　　　　　　　　　　　　　　　　　　　　　　　　　　　　6か月分（5名分）"},{"$f":"IF(Y14<0,-Y14,0)","v":0},{"$f":"IF(Y14>0,Y14,0)","v":60000}]
[null,{"$f":"COUNTIF($C$9:C15,TRUE)","v":3},true,6,{"$f":"IF(F15<$D$8,0,COUNTIF(F$9:$G15,'2ヶ月カレンダー (2)'!$D$21)+$D$8)","v":0},{"$f":"COUNTIF($G$9:G15,'2ヶ月カレンダー (2)'!$D$20)","v":6},"202109","2021-09-23","～","2021-09-23","現場パトロール",null,"A","B","D",{"$nulls":7},"組織活動費",null,{"v":1746,"d":"¥1,746"},"差入れ飲み物代","A ・ B","A ・ B  ・D","A ・ B  ・D","A ・ B  ・D","A ・ B  ・D","A ・ B  ・D","A ・ B  ・D","A ・ B  ・D","A ・ B  ・D","A ・ B  ・D","現場パトロール　　　　　　　　　　　　　　　　　　　　　　　　　　　　　　　　　　　　　　　　　　　　　　差入れ飲み物代","現場パトロール　　　　　　　　　　　　　　　　　　　　　　　　　　　　　　　　　　　　　　　　　　　　　　差入れ飲み物代　　　　　　　　　　　　　　　　　　　　　　現場パトロール　　　　　　　　　　　　　　　　　　　　　　　　　　　　　　　　　　　　　　　　　　　　　　昼食代（3名分)","現場パトロール　　　　　　　　　　　　　　　　　　　　　　　　　　　　　　　　　　　　　　　　　　　　　　差入れ飲み物代　　　　　　　　　　　　　　　　　　　　　　現場パトロール　　　　　　　　　　　　　　　　　　　　　　　　　　　　　　　　　　　　　　　　　　　　　　昼食代（3名分)　　　　　　　　　　　　　　　　　　　　　　　　　　　　安全衛生委員会　　　　　　　　　　　　　　　　　　　　　　　　　　　　　　　　　　　　　　　　　　　　　　","現場パトロール　　　　　　　　　　　　　　　　　　　　　　　　　　　　　　　　　　　　　　　　　　　　　　差入れ飲み物代　　　　　　　　　　　　　　　　　　　　　　現場パトロール　　　　　　　　　　　　　　　　　　　　　　　　　　　　　　　　　　　　　　　　　　　　　　昼食代（3名分)　　　　　　　　　　　　　　　　　　　　　　　　　　　　安全衛生委員会　　　　　　　　　　　　　　　　　　　　　　　　　　　　　　　　　　　　　　　　　　　　　　",0,1746]
[null,{"$f":"COUNTIF($C$9:C16,TRUE)","v":4},true,7,{"$f":"IF(F16<$D$8,0,COUNTIF(F$9:$G16,'2ヶ月カレンダー (2)'!$D$21)+$D$8)","v":0},{"$f":"COUNTIF($G$9:G16,'2ヶ月カレンダー (2)'!$D$20)","v":7},"202109","2021-09-23","～","2021-09-23","現場パトロール",null,"A","B","D",{"$nulls":7},"組織活動費",null,{"v":2560,"d":"¥2,560"},"昼食代（3名分)","A ・ B","A ・ B  ・D","A ・ B  ・D","A ・ B  ・D","A ・ B  ・D","A ・ B  ・D","A ・ B  ・D","A ・ B  ・D","A ・ B  ・D","A ・ B  ・D","現場パトロール　　　　　　　　　　　　　　　　　　　　　　　　　　　　　　　　　　　　　　　　　　　　　　昼食代（3名分)","現場パトロール　　　　　　　　　　　　　　　　　　　　　　　　　　　　　　　　　　　　　　　　　　　　　　昼食代（3名分)　　　　　　　　　　　　　　　　　　　　　　安全衛生委員会　　　　　　　　　　　　　　　　　　　　　　　　　　　　　　　　　　　　　　　　　　　　　　","現場パトロール　　　　　　　　　　　　　　　　　　　　　　　　　　　　　　　　　　　　　　　　　　　　　　昼食代（3名分)　　　　　　　　　　　　　　　　　　　　　　安全衛生委員会　　　　　　　　　　　　　　　　　　　　　　　　　　　　　　　　　　　　　　　　　　　　　　","現場パトロール　　　　　　　　　　　　　　　　　　　　　　　　　　　　　　　　　　　　　　　　　　　　　　昼食代（3名分)　　　　　　　　　　　　　　　　　　　　　　安全衛生委員会　　　　　　　　　　　　　　　　　　　　　　　　　　　　　　　　　　　　　　　　　　　　　　",0,2560]
[null,{"$f":"COUNTIF($C$9:C17,TRUE)","v":5},true,8,{"$f":"IF(F17<$D$8,0,COUNTIF(F$9:$G17,'2ヶ月カレンダー (2)'!$D$21)+$D$8)","v":8},{"$f":"COUNTIF($G$9:G17,'2ヶ月カレンダー (2)'!$D$20)","v":8},"202109","2021-09-23","～","2021-09-23","安全衛生委員会",null,"執行委員",{"$nulls":11},0,null,"執行委員","執行委員","執行委員","執行委員","執行委員","執行委員","執行委員","執行委員","執行委員","執行委員","安全衛生委員会　　　　　　　　　　　　　　　　　　　　　　　　　　　　　　　　　　　　　　　　　　　　　　","安全衛生委員会　　　　　　　　　　　　　　　　　　　　　　　　　　　　　　　　　　　　　　　　　　　　　　","安全衛生委員会　　　　　　　　　　　　　　　　　　　　　　　　　　　　　　　　　　　　　　　　　　　　　　","安全衛生委員会　　　　　　　　　　　　　　　　　　　　　　　　　　　　　　　　　　　　　　　　　　　　　　",0,0]
[null,{"$f":"COUNTIF($C$9:C18,TRUE)","v":6},true,9,{"$f":"IF(F18<$D$8,0,COUNTIF(F$9:$G18,'2ヶ月カレンダー (2)'!$D$21)+$D$8)","v":9},{"$f":"COUNTIF($G$9:G18,'2ヶ月カレンダー (2)'!$D$20)","v":8},"202110","2021-10-12",{"$f":"IF(H18=\"\",\"\",\"～\")","v":"～"},"2021-10-12","第2回分会執行委員会",null,"A","B","C","D",{"$nulls":6},"組織活動費",null,{"v":650,"d":"¥650"},"飲み物代（E：業務都合で欠席）","A ・ B","A ・ B  ・C","A ・ B  ・C  ・D","A ・ B  ・C  ・D","A ・ B  ・C  ・D","A ・ B  ・C  ・D","A ・ B  ・C  ・D","A ・ B  ・C  ・D","A ・ B  ・C  ・D","A ・ B  ・C  ・D","第2回分会執行委員会　　　　　　　　　　　　　　　　　　　　　　　　　　　　　　　　　　　　　　　　　　　　　　飲み物代（E：業務都合で欠席）","第2回分会執行委員会　　　　　　　　　　　　　　　　　　　　　　　　　　　　　　　　　　　　　　　　　　　　　　飲み物代（E：業務都合で欠席）","第2回分会執行委員会　　　　　　　　　　　　　　　　　　　　　　　　　　　　　　　　　　　　　　　　　　　　　　飲み物代（E：業務都合で欠席）","第2回分会執行委員会　　　　　　　　　　　　　　　　　　　　　　　　　　　　　　　　　　　　　　　　　　　　　　飲み物代（E：業務都合で欠席）",0,650]
[null,{"$f":"COUNTIF($C$9:C19,TRUE)","v":6},false,10,{"$f":"IF(F19<$D$8,0,COUNTIF(F$9:$G19,'2ヶ月カレンダー (2)'!$D$21)+$D$8)","v":10},{"$f":"COUNTIF($G$9:G19,'2ヶ月カレンダー (2)'!$D$20)","v":8},"202110","2021-10-15","～","2021-10-15","組織活動費　申請",null,"C",{"$nulls":9},"申請金額",{"v":80000,"d":"¥80,000"},0,"分会集会・執行委員会時　飲食費用として","C","C","C","C","C","C","C","C","C","C","組織活動費　申請　　　　　　　　　　　　　　　　　　　　　　　　　　　　　　　　　　　　　　　　　　　　　　分会集会・執行委員会時　飲食費用として","組織活動費　申請　　　　　　　　　　　　　　　　　　　　　　　　　　　　　　　　　　　　　　　　　　　　　　分会集会・執行委員会時　飲食費用として","組織活動費　申請　　　　　　　　　　　　　　　　　　　　　　　　　　　　　　　　　　　　　　　　　　　　　　分会集会・執行委員会時　飲食費用として","組織活動費　申請　　　　　　　　　　　　　　　　　　　　　　　　　　　　　　　　　　　　　　　　　　　　　　分会集会・執行委員会時　飲食費用として",0,0]
[null,{"$f":"COUNTIF($C$9:C20,TRUE)","v":7},true,11,{"$f":"IF(F20<$D$8,0,COUNTIF(F$9:$G20,'2ヶ月カレンダー (2)'!$D$21)+$D$8)","v":11},{"$f":"COUNTIF($G$9:G20,'2ヶ月カレンダー (2)'!$D$20)","v":8},"202110","2021-10-20",{"$f":"IF(H20=\"\",\"\",\"～\")","v":"～"},"2021-10-20","第1回分会集会",null,"全員",{"$nulls":9},"組織活動費",null,{"v":4440,"d":"¥4,440"},"飲み物代","全員","全員","全員","全員","全員","全員","全員","全員","全員","全員","第1回分会集会　　　　　　　　　　　　　　　　　　　　　　　　　　　　　　　　　　　　　　　　　　　　　　飲み物代","第1回分会集会　　　　　　　　　　　　　　　　　　　　　　　　　　　　　　　　　　　　　　　　　　　　　　飲み物代　　　　　　　　　　　　　　　　　　　　　　第1回分会集会　懇親会　　　　　　　　　　　　　　　　　　　　　　　　　　　　　　　　　　　　　　　　　　　　　　懇親会飲食代補助（会費不足分として）","第1回分会集会　　　　　　　　　　　　　　　　　　　　　　　　　　　　　　　　　　　　　　　　　　　　　　飲み物代　　　　　　　　　　　　　　　　　　　　　　第1回分会集会　懇親会　　　　　　　　　　　　　　　　　　　　　　　　　　　　　　　　　　　　　　　　　　　　　　懇親会飲食代補助（会費不足分として）","第1回分会集会　　　　　　　　　　　　　　　　　　　　　　　　　　　　　　　　　　　　　　　　　　　　　　飲み物代　　　　　　　　　　　　　　　　　　　　　　第1回分会集会　懇親会　　　　　　　　　　　　　　　　　　　　　　　　　　　　　　　　　　　　　　　　　　　　　　懇親会飲食代補助（会費不足分として）",0,4440]
[null,{"$f":"COUNTIF($C$9:C21,TRUE)","v":7},false,12,{"$f":"IF(F21<$D$8,0,COUNTIF(F$9:$G21,'2ヶ月カレンダー (2)'!$D$21)+$D$8)","v":12},{"$f":"COUNTIF($G$9:G21,'2ヶ月カレンダー (2)'!$D$20)","v":8},"202110","2021-10-20","～","2021-10-20","第1回分会集会　懇親会",null,"執行委員",{"$nulls":9},"組織活動費",null,{"v":27000,"d":"¥27,000"},"懇親会飲食代補助（会費不足分として）","執行委員","執行委員","執行委員","執行委員","執行委員","執行委員","執行委員","執行委員","執行委員","執行委員","第1回分会集会　懇親会　　　　　　　　　　　　　　　　　　　　　　　　　　　　　　　　　　　　　　　　　　　　　　懇親会飲食代補助（会費不足分として）","第1回分会集会　懇親会　　　　　　　　　　　　　　　　　　　　　　　　　　　　　　　　　　　　　　　　　　　　　　懇親会飲食代補助（会費不足分として）","第1回分会集会　懇親会　　　　　　　　　　　　　　　　　　　　　　　　　　　　　　　　　　　　　　　　　　　　　　懇親会飲食代補助（会費不足分として）","第1回分会集会　懇親会　　　　　　　　　　　　　　　　　　　　　　　　　　　　　　　　　　　　　　　　　　　　　　懇親会飲食代補助（会費不足分として）",0,27000]
[null,{"$f":"COUNTIF($C$9:C22,TRUE)","v":8},true,12,{"$f":"IF(F22<$D$8,0,COUNTIF(F$9:$G22,'2ヶ月カレンダー (2)'!$D$21)+$D$8)","v":12},{"$f":"COUNTIF($G$9:G22,'2ヶ月カレンダー (2)'!$D$20)","v":8},"202111","2021-11-15","～","2021-11-15","第3回分会執行委員会",null,"執行委員",{"$nulls":9},"組織活動費",null,{"v":800,"d":"¥800"},"飲み物代","執行委員","執行委員","執行委員","執行委員","執行委員","執行委員","執行委員","執行委員","執行委員","執行委員","第3回分会執行委員会　　　　　　　　　　　　　　　　　　　　　　　　　　　　　　　　　　　　　　　　　　　　　　飲み物代","第3回分会執行委員会　　　　　　　　　　　　　　　　　　　　　　　　　　　　　　　　　　　　　　　　　　　　　　飲み物代","第3回分会執行委員会　　　　　　　　　　　　　　　　　　　　　　　　　　　　　　　　　　　　　　　　　　　　　　飲み物代","第3回分会執行委員会　　　　　　　　　　　　　　　　　　　　　　　　　　　　　　　　　　　　　　　　　　　　　　飲み物代",0,800]
[null,{"$f":"COUNTIF($C$9:C23,TRUE)","v":9},true,12,{"$f":"IF(F23<$D$8,0,COUNTIF(F$9:$G23,'2ヶ月カレンダー (2)'!$D$21)+$D$8)","v":12},{"$f":"COUNTIF($G$9:G23,'2ヶ月カレンダー (2)'!$D$20)","v":8},"202111","2021-11-20","～","2021-11-20","電力地協　代表者会議",null,"A",{"$nulls":9},"組織活動費",null,{"v":900,"d":"¥900"},"駐車場代","A","A","A","A","A","A","A","A","A","A","電力地協　代表者会議　　　　　　　　　　　　　　　　　　　　　　　　　　　　　　　　　　　　　　　　　　　　　　駐車場代","電力地協　代表者会議　　　　　　　　　　　　　　　　　　　　　　　　　　　　　　　　　　　　　　　　　　　　　　駐車場代","電力地協　代表者会議　　　　　　　　　　　　　　　　　　　　　　　　　　　　　　　　　　　　　　　　　　　　　　駐車場代","電力地協　代表者会議　　　　　　　　　　　　　　　　　　　　　　　　　　　　　　　　　　　　　　　　　　　　　　駐車場代",0,900]
[null,{"$f":"COUNTIF($C$9:C24,TRUE)","v":10},true,12,{"$f":"IF(F24<$D$8,0,COUNTIF(F$9:$G24,'2ヶ月カレンダー (2)'!$D$21)+$D$8)","v":12},{"$f":"COUNTIF($G$9:G24,'2ヶ月カレンダー (2)'!$D$20)","v":8},"202111","2021-11-24","～","2021-11-24","安全衛生委員会",null,"執行委員",{"$nulls":11},0,null,"執行委員","執行委員","執行委員","執行委員","執行委員","執行委員","執行委員","執行委員","執行委員","執行委員","安全衛生委員会　　　　　　　　　　　　　　　　　　　　　　　　　　　　　　　　　　　　　　　　　　　　　　","安全衛生委員会　　　　　　　　　　　　　　　　　　　　　　　　　　　　　　　　　　　　　　　　　　　　　　　　　　　　　　　　　　　　　　　　　　　　労使協議会　　　　　　　　　　　　　　　　　　　　　　　　　　　　　　　　　　　　　　　　　　　　　　","安全衛生委員会　　　　　　　　　　　　　　　　　　　　　　　　　　　　　　　　　　　　　　　　　　　　　　　　　　　　　　　　　　　　　　　　　　　　労使協議会　　　　　　　　　　　　　　　　　　　　　　　　　　　　　　　　　　　　　　　　　　　　　　","安全衛生委員会　　　　　　　　　　　　　　　　　　　　　　　　　　　　　　　　　　　　　　　　　　　　　　　　　　　　　　　　　　　　　　　　　　　　労使協議会　　　　　　　　　　　　　　　　　　　　　　　　　　　　　　　　　　　　　　　　　　　　　　",0,0]
[null,{"$f":"COUNTIF($C$9:C25,TRUE)","v":11},true,12,{"$f":"IF(F25<$D$8,0,COUNTIF(F$9:$G25,'2ヶ月カレンダー (2)'!$D$21)+$D$8)","v":12},{"$f":"COUNTIF($G$9:G25,'2ヶ月カレンダー (2)'!$D$20)","v":8},"202111","2021-11-24","～","2021-11-24","労使協議会",null,"執行委員",{"$nulls":11},0,null,"執行委員","執行委員","執行委員","執行委員","執行委員","執行委員","執行委員","執行委員","執行委員","執行委員","労使協議会　　　　　　　　　　　　　　　　　　　　　　　　　　　　　　　　　　　　　　　　　　　　　　","労使協議会　　　　　　　　　　　　　　　　　　　　　　　　　　　　　　　　　　　　　　　　　　　　　　","労使協議会　　　　　　　　　　　　　　　　　　　　　　　　　　　　　　　　　　　　　　　　　　　　　　","労使協議会　　　　　　　　　　　　　　　　　　　　　　　　　　　　　　　　　　　　　　　　　　　　　　",0,0]
[null,{"$f":"COUNTIF($C$9:C26,TRUE)","v":12},true,12,{"$f":"IF(F26<$D$8,0,COUNTIF(F$9:$G26,'2ヶ月カレンダー (2)'!$D$21)+$D$8)","v":12},{"$f":"COUNTIF($G$9:G26,'2ヶ月カレンダー (2)'!$D$20)","v":8},"202112","2021-12-15","～","2021-12-15","分会クリスマス会第1回実行委員会",null,"G","B","C","D","E",{"$nulls":5},"組織活動費",null,{"v":650,"d":"¥650"},"飲み物代","G ・ B","G ・ B  ・C","G ・ B  ・C  ・D","G ・ B  ・C  ・D  ・E","G ・ B  ・C  ・D  ・E","G ・ B  ・C  ・D  ・E","G ・ B  ・C  ・D  ・E","G ・ B  ・C  ・D  ・E","G ・ B  ・C  ・D  ・E","G ・ B  ・C  ・D  ・E","分会クリスマス会第1回実行委員会　　　　　　　　　　　　　　　　　　　　　　　　　　　　　　　　　　　　　　　　　　　　　　飲み物代","分会クリスマス会第1回実行委員会　　　　　　　　　　　　　　　　　　　　　　　　　　　　　　　　　　　　　　　　　　　　　　飲み物代","分会クリスマス会第1回実行委員会　　　　　　　　　　　　　　　　　　　　　　　　　　　　　　　　　　　　　　　　　　　　　　飲み物代",{"$f":"IF(H26=H14,AM26&\"　　　　　　　　　　　　　　　　　　　　　　　　　　\"&AK14,AM26)","v":"分会クリスマス会第1回実行委員会　　　　　　　　　　　　　　　　　　　　　　　　　　　　　　　　　　　　　　　　　　　　　　飲み物代"},0,650]
[null,{"$f":"COUNTIF($C$9:C27,TRUE)","v":12},false,12,{"$f":"IF(F27<$D$8,0,COUNTIF(F$9:$G27,'2ヶ月カレンダー (2)'!$D$21)+$D$8)","v":12},{"$f":"COUNTIF($G$9:G27,'2ヶ月カレンダー (2)'!$D$20)","v":8},"202112","2021-12-16",{"$f":"IF(H27=\"\",\"\",\"～\")","v":"～"},"2021-12-16","組織活動費　申請",null,"C",{"$nulls":9},"申請金額",{"v":50000,"d":"¥50,000"},0,"クリスマス会　グッズ購入・飲食費用として","C","C","C","C","C","C","C","C","C","C","組織活動費　申請　　　　　　　　　　　　　　　　　　　　　　　　　　　　　　　　　　　　　　　　　　　　　　クリスマス会　グッズ購入・飲食費用として","組織活動費　申請　　　　　　　　　　　　　　　　　　　　　　　　　　　　　　　　　　　　　　　　　　　　　　クリスマス会　グッズ購入・飲食費用として",{"$f":"IF(H27=H14,AL27&\"　　　　　　　　　　　　　　　　　　　　　　　　　　　　\"&AK14,AL27)","v":"組織活動費　申請　　　　　　　　　　　　　　　　　　　　　　　　　　　　　　　　　　　　　　　　　　　　　　クリスマス会　グッズ購入・飲食費用として"},{"$f":"IF(H27=H29,AM27&\"　　　　　　　　　　　　　　　　　　　　　　　　　　\"&AK29,AM27)","v":"組織活動費　申請　　　　　　　　　　　　　　　　　　　　　　　　　　　　　　　　　　　　　　　　　　　　　　クリスマス会　グッズ購入・飲食費用として"},0,0]
[null,{"$f":"COUNTIF($C$9:C28,TRUE)","v":13},true,12,{"$f":"IF(F28<$D$8,0,COUNTIF(F$9:$G28,'2ヶ月カレンダー (2)'!$D$21)+$D$8)","v":12},{"$f":"COUNTIF($G$9:G28,'2ヶ月カレンダー (2)'!$D$20)","v":8},"202112","2021-12-22","～","2021-12-22","分会クリスマス会第2回実行委員会",null,"G","B","C","D","E",{"$nulls":5},"組織活動費",null,{"v":39200,"d":"¥39,200"},"パーティーグッズ・飲み物・お菓子購入","G ・ B","G ・ B  ・C","G ・ B  ・C  ・D","G ・ B  ・C  ・D  ・E","G ・ B  ・C  ・D  ・E","G ・ B  ・C  ・D  ・E","G ・ B  ・C  ・D  ・E","G ・ B  ・C  ・D  ・E","G ・ B  ・C  ・D  ・E","G ・ B  ・C  ・D  ・E","分会クリスマス会第2回実行委員会　　　　　　　　　　　　　　　　　　　　　　　　　　　　　　　　　　　　　　　　　　　　　　パーティーグッズ・飲み物・お菓子購入",{"$f":"IF(H28=H14,AK28&\"　　　　　　　　　　　　　　　　　　　　　　\"&AK14,AK28)","v":"分会クリスマス会第2回実行委員会　　　　　　　　　　　　　　　　　　　　　　　　　　　　　　　　　　　　　　　　　　　　　　パーティーグッズ・飲み物・お菓子購入"},{"$f":"IF(H28=H29,AL28&\"　　　　　　　　　　　　　　　　　　　　　　　　　　　　\"&AK29,AL28)","v":"分会クリスマス会第2回実行委員会　　　　　　　　　　　　　　　　　　　　　　　　　　　　　　　　　　　　　　　　　　　　　　パーティーグッズ・飲み物・お菓子購入"},{"$f":"IF(H28=H30,AM28&\"　　　　　　　　　　　　　　　　　　　　　　　　　　\"&AK30,AM28)","v":"分会クリスマス会第2回実行委員会　　　　　　　　　　　　　　　　　　　　　　　　　　　　　　　　　　　　　　　　　　　　　　パーティーグッズ・飲み物・お菓子購入"},0,39200]
[null,{"$f":"COUNTIF($C$9:C29,TRUE)","v":14},true,12,{"$f":"IF(F29<$D$8,0,COUNTIF(F$9:$G29,'2ヶ月カレンダー (2)'!$D$21)+$D$8)","v":12},{"$f":"COUNTIF($G$9:G29,'2ヶ月カレンダー (2)'!$D$20)","v":8},"202112","2021-12-24","～","2021-12-24","分会クリスマス会",null,"全員",{"$nulls":11},0,null,"全員","全員","全員","全員","全員","全員","全員","全員","全員","全員","分会クリスマス会　　　　　　　　　　　　　　　　　　　　　　　　　　　　　　　　　　　　　　　　　　　　　　","分会クリスマス会　　　　　　　　　　　　　　　　　　　　　　　　　　　　　　　　　　　　　　　　　　　　　　","分会クリスマス会　　　　　　　　　　　　　　　　　　　　　　　　　　　　　　　　　　　　　　　　　　　　　　","分会クリスマス会　　　　　　　　　　　　　　　　　　　　　　　　　　　　　　　　　　　　　　　　　　　　　　",0,0]
[null,{"$f":"COUNTIF($C$9:C30,TRUE)","v":15},true,12,{"$f":"IF(F30<$D$8,0,COUNTIF(F$9:$G30,'2ヶ月カレンダー (2)'!$D$21)+$D$8)","v":12},{"$f":"COUNTIF($G$9:G30,'2ヶ月カレンダー (2)'!$D$20)","v":8},"202201","2022-01-13","～","2022-01-13","労使パトロール",null,"A",{"$nulls":11},0,null,"A","A","A","A","A","A","A","A","A","A","労使パトロール　　　　　　　　　　　　　　　　　　　　　　　　　　　　　　　　　　　　　　　　　　　　　　","労使パトロール　　　　　　　　　　　　　　　　　　　　　　　　　　　　　　　　　　　　　　　　　　　　　　　　　　　　　　　　　　　　　　　　　　　　安全衛生委員会　　　　　　　　　　　　　　　　　　　　　　　　　　　　　　　　　　　　　　　　　　　　　　","労使パトロール　　　　　　　　　　　　　　　　　　　　　　　　　　　　　　　　　　　　　　　　　　　　　　　　　　　　　　　　　　　　　　　　　　　　安全衛生委員会　　　　　　　　　　　　　　　　　　　　　　　　　　　　　　　　　　　　　　　　　　　　　　","労使パトロール　　　　　　　　　　　　　　　　　　　　　　　　　　　　　　　　　　　　　　　　　　　　　　　　　　　　　　　　　　　　　　　　　　　　安全衛生委員会　　　　　　　　　　　　　　　　　　　　　　　　　　　　　　　　　　　　　　　　　　　　　　",0,0]
[null,{"$f":"COUNTIF($C$9:C31,TRUE)","v":16},true,12,{"$f":"IF(F31<$D$8,0,COUNTIF(F$9:$G31,'2ヶ月カレンダー (2)'!$D$21)+$D$8)","v":12},{"$f":"COUNTIF($G$9:G31,'2ヶ月カレンダー (2)'!$D$20)","v":8},"202201","2022-01-13","～","2022-01-13","安全衛生委員会",null,"執行委員",{"$nulls":11},0,null,"執行委員","執行委員","執行委員","執行委員","執行委員","執行委員","執行委員","執行委員","執行委員","執行委員","安全衛生委員会　　　　　　　　　　　　　　　　　　　　　　　　　　　　　　　　　　　　　　　　　　　　　　","安全衛生委員会　　　　　　　　　　　　　　　　　　　　　　　　　　　　　　　　　　　　　　　　　　　　　　","安全衛生委員会　　　　　　　　　　　　　　　　　　　　　　　　　　　　　　　　　　　　　　　　　　　　　　","安全衛生委員会　　　　　　　　　　　　　　　　　　　　　　　　　　　　　　　　　　　　　　　　　　　　　　",0,0]
[null,{"$f":"COUNTIF($C$9:C32,TRUE)","v":17},true,12,{"$f":"IF(F32<$D$8,0,COUNTIF(F$9:$G32,'2ヶ月カレンダー (2)'!$D$21)+$D$8)","v":12},{"$f":"COUNTIF($G$9:G32,'2ヶ月カレンダー (2)'!$D$20)","v":8},"202201","2022-01-14","～","2022-01-14","第4回分会執行委員会",null,"執行委員",{"$nulls":9},"組織活動費",null,{"v":600,"d":"¥600"},"飲み物代","執行委員","執行委員","執行委員","執行委員","執行委員","執行委員","執行委員","執行委員","執行委員","執行委員","第4回分会執行委員会　　　　　　　　　　　　　　　　　　　　　　　　　　　　　　　　　　　　　　　　　　　　　　飲み物代","第4回分会執行委員会　　　　　　　　　　　　　　　　　　　　　　　　　　　　　　　　　　　　　　　　　　　　　　飲み物代","第4回分会執行委員会　　　　　　　　　　　　　　　　　　　　　　　　　　　　　　　　　　　　　　　　　　　　　　飲み物代","第4回分会執行委員会　　　　　　　　　　　　　　　　　　　　　　　　　　　　　　　　　　　　　　　　　　　　　　飲み物代",0,600]
[null,{"$f":"COUNTIF($C$9:C33,TRUE)","v":18},true,12,{"$f":"IF(F33<$D$8,0,COUNTIF(F$9:$G33,'2ヶ月カレンダー (2)'!$D$21)+$D$8)","v":12},{"$f":"COUNTIF($G$9:G33,'2ヶ月カレンダー (2)'!$D$20)","v":8},"202201","2022-01-16","～","2022-01-16","分会委員長連絡会議",null,"A",{"$nulls":11},0,null,"A","A","A","A","A","A","A","A","A","A","分会委員長連絡会議　　　　　　　　　　　　　　　　　　　　　　　　　　　　　　　　　　　　　　　　　　　　　　","分会委員長連絡会議　　　　　　　　　　　　　　　　　　　　　　　　　　　　　　　　　　　　　　　　　　　　　　","分会委員長連絡会議　　　　　　　　　　　　　　　　　　　　　　　　　　　　　　　　　　　　　　　　　　　　　　","分会委員長連絡会議　　　　　　　　　　　　　　　　　　　　　　　　　　　　　　　　　　　　　　　　　　　　　　",0,0]
[null,{"$f":"COUNTIF($C$9:C34,TRUE)","v":18},false,12,{"$f":"IF(F34<$D$8,0,COUNTIF(F$9:$G34,'2ヶ月カレンダー (2)'!$D$21)+$D$8)","v":12},{"$f":"COUNTIF($G$9:G34,'2ヶ月カレンダー (2)'!$D$20)","v":8},"202202","2022-02-12","～","2022-02-12","活動調査費　6か月分（役員5名分）",null,"執行委員",{"$nulls":9},"活動調査費",null,{"v":60000,"d":"¥60,000"},null,"執行委員","執行委員","執行委員","執行委員","執行委員","執行委員","執行委員","執行委員","執行委員","執行委員","活動調査費　6か月分（役員5名分）　　　　　　　　　　　　　　　　　　　　　　　　　　　　　　　　　　　　　　　　　　　　　　","活動調査費　6か月分（役員5名分）　　　　　　　　　　　　　　　　　　　　　　　　　　　　　　　　　　　　　　　　　　　　　　","活動調査費　6か月分（役員5名分）　　　　　　　　　　　　　　　　　　　　　　　　　　　　　　　　　　　　　　　　　　　　　　","活動調査費　6か月分（役員5名分）　　　　　　　　　　　　　　　　　　　　　　　　　　　　　　　　　　　　　　　　　　　　　　",0,60000]
[null,{"$f":"COUNTIF($C$9:C35,TRUE)","v":19},true,12,{"$f":"IF(F35<$D$8,0,COUNTIF(F$9:$G35,'2ヶ月カレンダー (2)'!$D$21)+$D$8)","v":12},{"$f":"COUNTIF($G$9:G35,'2ヶ月カレンダー (2)'!$D$20)","v":8},"202202","2022-02-17","～","2022-02-17","分会ボウリング大会第1回実行委員会",null,"G","B","C","D","E",{"$nulls":5},"組織活動費",null,{"v":650,"d":"¥650"},"飲み物代","G ・ B","G ・ B  ・C","G ・ B  ・C  ・D","G ・ B  ・C  ・D  ・E","G ・ B  ・C  ・D  ・E","G ・ B  ・C  ・D  ・E","G ・ B  ・C  ・D  ・E","G ・ B  ・C  ・D  ・E","G ・ B  ・C  ・D  ・E","G ・ B  ・C  ・D  ・E","分会ボウリング大会第1回実行委員会　　　　　　　　　　　　　　　　　　　　　　　　　　　　　　　　　　　　　　　　　　　　　　飲み物代","分会ボウリング大会第1回実行委員会　　　　　　　　　　　　　　　　　　　　　　　　　　　　　　　　　　　　　　　　　　　　　　飲み物代","分会ボウリング大会第1回実行委員会　　　　　　　　　　　　　　　　　　　　　　　　　　　　　　　　　　　　　　　　　　　　　　飲み物代","分会ボウリング大会第1回実行委員会　　　　　　　　　　　　　　　　　　　　　　　　　　　　　　　　　　　　　　　　　　　　　　飲み物代",0,650]
[null,{"$f":"COUNTIF($C$9:C36,TRUE)","v":19},false,12,{"$f":"IF(F36<$D$8,0,COUNTIF(F$9:$G36,'2ヶ月カレンダー (2)'!$D$21)+$D$8)","v":12},{"$f":"COUNTIF($G$9:G36,'2ヶ月カレンダー (2)'!$D$20)","v":8},"202202","2022-02-18","～","2022-02-18","組織活動費　申請",{"$nulls":11},"申請金額",{"v":40000,"d":"¥40,000"},null,"分会ボウリング大会　会場費・景品代として",0,0,0,0,0,0,0,0,0,0,"組織活動費　申請　　　　　　　　　　　　　　　　　　　　　　　　　　　　　　　　　　　　　　　　　　　　　　分会ボウリング大会　会場費・景品代として","組織活動費　申請　　　　　　　　　　　　　　　　　　　　　　　　　　　　　　　　　　　　　　　　　　　　　　分会ボウリング大会　会場費・景品代として","組織活動費　申請　　　　　　　　　　　　　　　　　　　　　　　　　　　　　　　　　　　　　　　　　　　　　　分会ボウリング大会　会場費・景品代として","組織活動費　申請　　　　　　　　　　　　　　　　　　　　　　　　　　　　　　　　　　　　　　　　　　　　　　分会ボウリング大会　会場費・景品代として",0,0]
[null,{"$f":"COUNTIF($C$9:C37,TRUE)","v":20},true,12,{"$f":"IF(F37<$D$8,0,COUNTIF(F$9:$G37,'2ヶ月カレンダー (2)'!$D$21)+$D$8)","v":12},{"$f":"COUNTIF($G$9:G37,'2ヶ月カレンダー (2)'!$D$20)","v":8},"202202","2022-02-27","～","2022-02-27","分会ボウリング大会第2回実行委員会",null,"G","B","C","D","E","A",{"$nulls":4},"組織活動費",null,{"v":9800,"d":"¥9,800"},"景品購入代","G ・ B","G ・ B  ・C","G ・ B  ・C  ・D","G ・ B  ・C  ・D  ・E","G ・ B  ・C  ・D  ・E  ・A","G ・ B  ・C  ・D  ・E  ・A","G ・ B  ・C  ・D  ・E  ・A","G ・ B  ・C  ・D  ・E  ・A","G ・ B  ・C  ・D  ・E  ・A","G ・ B  ・C  ・D  ・E  ・A","分会ボウリング大会第2回実行委員会　　　　　　　　　　　　　　　　　　　　　　　　　　　　　　　　　　　　　　　　　　　　　　景品購入代","分会ボウリング大会第2回実行委員会　　　　　　　　　　　　　　　　　　　　　　　　　　　　　　　　　　　　　　　　　　　　　　景品購入代　　　　　　　　　　　　　　　　　　　　　　分会ボウリング大会　　　　　　　　　　　　　　　　　　　　　　　　　　　　　　　　　　　　　　　　　　　　　　会場利用料、飲み物代","分会ボウリング大会第2回実行委員会　　　　　　　　　　　　　　　　　　　　　　　　　　　　　　　　　　　　　　　　　　　　　　景品購入代　　　　　　　　　　　　　　　　　　　　　　分会ボウリング大会　　　　　　　　　　　　　　　　　　　　　　　　　　　　　　　　　　　　　　　　　　　　　　会場利用料、飲み物代","分会ボウリング大会第2回実行委員会　　　　　　　　　　　　　　　　　　　　　　　　　　　　　　　　　　　　　　　　　　　　　　景品購入代　　　　　　　　　　　　　　　　　　　　　　分会ボウリング大会　　　　　　　　　　　　　　　　　　　　　　　　　　　　　　　　　　　　　　　　　　　　　　会場利用料、飲み物代",0,9800]
[null,{"$f":"COUNTIF($C$9:C38,TRUE)","v":21},true,12,{"$f":"IF(F38<$D$8,0,COUNTIF(F$9:$G38,'2ヶ月カレンダー (2)'!$D$21)+$D$8)","v":12},{"$f":"COUNTIF($G$9:G38,'2ヶ月カレンダー (2)'!$D$20)","v":8},"202202","2022-02-27","～","2022-02-27","分会ボウリング大会",null,"全員",{"$nulls":9},"組織活動費",null,{"v":24800,"d":"¥24,800"},"会場利用料、飲み物代","全員","全員","全員","全員","全員","全員","全員","全員","全員","全員","分会ボウリング大会　　　　　　　　　　　　　　　　　　　　　　　　　　　　　　　　　　　　　　　　　　　　　　会場利用料、飲み物代","分会ボウリング大会　　　　　　　　　　　　　　　　　　　　　　　　　　　　　　　　　　　　　　　　　　　　　　会場利用料、飲み物代","分会ボウリング大会　　　　　　　　　　　　　　　　　　　　　　　　　　　　　　　　　　　　　　　　　　　　　　会場利用料、飲み物代","分会ボウリング大会　　　　　　　　　　　　　　　　　　　　　　　　　　　　　　　　　　　　　　　　　　　　　　会場利用料、飲み物代",0,24800]
[null,{"$f":"COUNTIF($C$9:C39,TRUE)","v":21},false,12,{"$f":"IF(F39<$D$8,0,COUNTIF(F$9:$G39,'2ヶ月カレンダー (2)'!$D$21)+$D$8)","v":12},{"$f":"COUNTIF($G$9:G39,'2ヶ月カレンダー (2)'!$D$20)","v":8},"",null,"",{"$nulls":17},0,0,0,0,0,0,0,0,0,0,"　　　　　　　　　　　　　　　　　　　　　　　　　　　　　　　　　　　　　　　　　　　　　　","　　　　　　　　　　　　　　　　　　　　　　　　　　　　　　　　　　　　　　　　　　　　　　　　　　　　　　　　　　　　　　　　　　　　　　　　　　　　　　　　　　　　　　　　　　　　　　　　　　　　　　　　　　　　　　　　　　","　　　　　　　　　　　　　　　　　　　　　　　　　　　　　　　　　　　　　　　　　　　　　　　　　　　　　　　　　　　　　　　　　　　　　　　　　　　　　　　　　　　　　　　　　　　　　　　　　　　　　　　　　　　　　　　　　　　　　　　　　　　　　　　　　　　　　　　　　　　　　　　　　　　　　　　　　　　　　　　　　　　　　　　　　　　　　　　　　　　　　　　　　　　　","　　　　　　　　　　　　　　　　　　　　　　　　　　　　　　　　　　　　　　　　　　　　　　　　　　　　　　　　　　　　　　　　　　　　　　　　　　　　　　　　　　　　　　　　　　　　　　　　　　　　　　　　　　　　　　　　　　　　　　　　　　　　　　　　　　　　　　　　　　　　　　　　　　　　　　　　　　　　　　　　　　　　　　　　　　　　　　　　　　　　　　　　　　　　　　　　　　　　　　　　　　　　　　　　　　　　　　　　　　　　　　　　　　　　　　　　　　　　　　　　　　　　　　　　　　　　　　　　　　　　",0,0]
[null,{"$f":"COUNTIF($C$9:C40,TRUE)","v":21},false,12,{"$f":"IF(F40<$D$8,0,COUNTIF(F$9:$G40,'2ヶ月カレンダー (2)'!$D$21)+$D$8)","v":12},{"$f":"COUNTIF($G$9:G40,'2ヶ月カレンダー (2)'!$D$20)","v":8},"",null,"",{"$nulls":17},0,0,0,0,0,0,0,0,0,0,"　　　　　　　　　　　　　　　　　　　　　　　　　　　　　　　　　　　　　　　　　　　　　　","　　　　　　　　　　　　　　　　　　　　　　　　　　　　　　　　　　　　　　　　　　　　　　　　　　　　　　　　　　　　　　　　　　　　　　　　　　　　　　　　　　　　　　　　　　　　　　　　　　　　　　　　　　　　　　　　　　","　　　　　　　　　　　　　　　　　　　　　　　　　　　　　　　　　　　　　　　　　　　　　　　　　　　　　　　　　　　　　　　　　　　　　　　　　　　　　　　　　　　　　　　　　　　　　　　　　　　　　　　　　　　　　　　　　　　　　　　　　　　　　　　　　　　　　　　　　　　　　　　　　　　　　　　　　　　　　　　　　　　　　　　　　　　　　　　　　　　　　　　　　　　　","　　　　　　　　　　　　　　　　　　　　　　　　　　　　　　　　　　　　　　　　　　　　　　　　　　　　　　　　　　　　　　　　　　　　　　　　　　　　　　　　　　　　　　　　　　　　　　　　　　　　　　　　　　　　　　　　　　　　　　　　　　　　　　　　　　　　　　　　　　　　　　　　　　　　　　　　　　　　　　　　　　　　　　　　　　　　　　　　　　　　　　　　　　　　　　　　　　　　　　　　　　　　　　　　　　　　　　　　　　　　　　　　　　　　　　　　　　　　　　　　　　　　　　　　　　　　　　　　　　　　",0,0]
[null,{"$f":"COUNTIF($C$9:C41,TRUE)","v":21},false,12,{"$f":"IF(F41<$D$8,0,COUNTIF(F$9:$G41,'2ヶ月カレンダー (2)'!$D$21)+$D$8)","v":12},{"$f":"COUNTIF($G$9:G41,'2ヶ月カレンダー (2)'!$D$20)","v":8},"",null,"",{"$nulls":17},0,0,0,0,0,0,0,0,0,0,"　　　　　　　　　　　　　　　　　　　　　　　　　　　　　　　　　　　　　　　　　　　　　　","　　　　　　　　　　　　　　　　　　　　　　　　　　　　　　　　　　　　　　　　　　　　　　　　　　　　　　　　　　　　　　　　　　　　　　　　　　　　　　　　　　　　　　　　　　　　　　　　　　　　　　　　　　　　　　　　　　","　　　　　　　　　　　　　　　　　　　　　　　　　　　　　　　　　　　　　　　　　　　　　　　　　　　　　　　　　　　　　　　　　　　　　　　　　　　　　　　　　　　　　　　　　　　　　　　　　　　　　　　　　　　　　　　　　　　　　　　　　　　　　　　　　　　　　　　　　　　　　　　　　　　　　　　　　　　　　　　　　　　　　　　　　　　　　　　　　　　　　　　　　　　　","　　　　　　　　　　　　　　　　　　　　　　　　　　　　　　　　　　　　　　　　　　　　　　　　　　　　　　　　　　　　　　　　　　　　　　　　　　　　　　　　　　　　　　　　　　　　　　　　　　　　　　　　　　　　　　　　　　　　　　　　　　　　　　　　　　　　　　　　　　　　　　　　　　　　　　　　　　　　　　　　　　　　　　　　　　　　　　　　　　　　　　　　　　　　　　　　　　　　　　　　　　　　　　　　　　　　　　　　　　　　　　　　　　　　　　　　　　　　　　　　　　　　　　　　　　　　　　　　　　　　",{"$f":"IF(Y41<0,-Y41,0)","v":0},0]
[null,{"$f":"COUNTIF($C$9:C42,TRUE)","v":21},false,{"$f":"IF(E42<F42,F42,E42)","v":12},{"$f":"IF(F42<$D$8,0,COUNTIF(F$9:$G42,'2ヶ月カレンダー (2)'!$D$21)+$D$8)","v":12},{"$f":"COUNTIF($G$9:G42,'2ヶ月カレンダー (2)'!$D$20)","v":8},{"$f":"IF(H42=\"\",\"\",TEXT(H42,\"yyyymm\"))","v":""},null,{"$f":"IF(H42=\"\",\"\",\"～\")","v":""},{"$nulls":17},{"$f":"IF(N42=\"\",M42,M42&\" ・ \"&N42)","v":0},{"$f":"IF(O42=\"\",AA42,AA42&\"  ・\"&O42)","v":0},{"$f":"IF(P42=\"\",AB42,AB42&\"  ・\"&P42)","v":0},{"$f":"IF(Q42=\"\",AC42,AC42&\"  ・\"&Q42)","v":0},{"$f":"IF(R42=\"\",AD42,AD42&\"  ・\"&R42)","v":0},{"$f":"IF(S42=\"\",AE42,AE42&\"  ・\"&S42)","v":0},{"$f":"IF(T42=\"\",AF42,AF42&\"  ・\"&T42)","v":0},{"$f":"IF(U42=\"\",AG42,AG42&\"  ・\"&U42)","v":0},{"$f":"IF(V42=\"\",AH42,AH42&\"  ・\"&V42)","v":0},{"$f":"IF(N42=\"\",M42,IF(O42=\"\",AA42,IF(P42=\"\",AB42,IF(Q42=\"\",AC42,IF(R42=\"\",AD42,IF(S42=\"\",AE42,IF(T42=\"\",AF42,IF(U42=\"\",AG42,IF(V42=\"\",AH42,\"全員\")))))))))","v":0},{"$f":"K42&\"　　　　　　　　　　　　　　　　　　　　　　\"&\"　　　　　　　　　　　　　　　　　　　　　　　　\"&Z42","v":"　　　　　　　　　　　　　　　　　　　　　　　　　　　　　　　　　　　　　　　　　　　　　　"},{"$f":"IF(H42=H43,AK42&\"　　　　　　　　　　　　　　　　　　　　　　\"&AK43,AK42)","v":"　　　　　　　　　　　　　　　　　　　　　　　　　　　　　　　　　　　　　　　　　　　　　　　　　　　　　　　　　　　　　　　　　　　　　　　　　　　　　　　　　　　　　　　　　　　　　　　　　　　　　　　　　　　　　　　　　　"},{"$f":"IF(H42=H44,AL42&\"　　　　　　　　　　　　　　　　　　　　　　　　　　　　\"&AK44,AL42)","v":"　　　　　　　　　　　　　　　　　　　　　　　　　　　　　　　　　　　　　　　　　　　　　　　　　　　　　　　　　　　　　　　　　　　　　　　　　　　　　　　　　　　　　　　　　　　　　　　　　　　　　　　　　　　　　　　　　　　　　　　　　　　　　　　　　　　　　　　　　　　　　　　　　　　　　　　　　　　　　　　　　　　　　　　　　　　　　　　　　　　　　　　　　　　　"},{"$f":"IF(H42=H45,AM42&\"　　　　　　　　　　　　　　　　　　　　　　　　　　\"&AK45,AM42)","v":"　　　　　　　　　　　　　　　　　　　　　　　　　　　　　　　　　　　　　　　　　　　　　　　　　　　　　　　　　　　　　　　　　　　　　　　　　　　　　　　　　　　　　　　　　　　　　　　　　　　　　　　　　　　　　　　　　　　　　　　　　　　　　　　　　　　　　　　　　　　　　　　　　　　　　　　　　　　　　　　　　　　　　　　　　　　　　　　　　　　　　　　　　　　　　　　　　　　　　　　　　　　　　　　　　　　　　　　　　　　　　　　　　　　　　　　　　　　　　　　　　　　　　　　　　　　　　　　　　　　　"},0,{"$f":"IF(Y42>0,Y42,0)","v":0}]
[null,{"$f":"COUNTIF($C$9:C43,TRUE)","v":21},false,12,{"$f":"IF(F43<$D$8,0,COUNTIF(F$9:$G43,'2ヶ月カレンダー (2)'!$D$21)+$D$8)","v":12},{"$f":"COUNTIF($G$9:G43,'2ヶ月カレンダー (2)'!$D$20)","v":8},"",null,"",{"$nulls":17},0,0,0,0,0,0,0,0,0,0,"　　　　　　　　　　　　　　　　　　　　　　　　　　　　　　　　　　　　　　　　　　　　　　","　　　　　　　　　　　　　　　　　　　　　　　　　　　　　　　　　　　　　　　　　　　　　　　　　　　　　　　　　　　　　　　　　　　　　　　　　　　　　　　　　　　　　　　　　　　　　　　　　　　　　　　　　　　　　　　　　　","　　　　　　　　　　　　　　　　　　　　　　　　　　　　　　　　　　　　　　　　　　　　　　　　　　　　　　　　　　　　　　　　　　　　　　　　　　　　　　　　　　　　　　　　　　　　　　　　　　　　　　　　　　　　　　　　　　　　　　　　　　　　　　　　　　　　　　　　　　　　　　　　　　　　　　　　　　　　　　　　　　　　　　　　　　　　　　　　　　　　　　　　　　　　","　　　　　　　　　　　　　　　　　　　　　　　　　　　　　　　　　　　　　　　　　　　　　　　　　　　　　　　　　　　　　　　　　　　　　　　　　　　　　　　　　　　　　　　　　　　　　　　　　　　　　　　　　　　　　　　　　　　　　　　　　　　　　　　　　　　　　　　　　　　　　　　　　　　　　　　　　　　　　　　　　　　　　　　　　　　　　　　　　　　　　　　　　　　　　　　　　　　　　　　　　　　　　　　　　　　　　　　　　　　　　　　　　　　　　　　　　　　　　　　　　　　　　　　　　　　　　　　　　　　　",0,0]
[null,{"$f":"COUNTIF($C$9:C44,TRUE)","v":21},false,12,{"$f":"IF(F44<$D$8,0,COUNTIF(F$9:$G44,'2ヶ月カレンダー (2)'!$D$21)+$D$8)","v":12},{"$f":"COUNTIF($G$9:G44,'2ヶ月カレンダー (2)'!$D$20)","v":8},"",null,"",{"$nulls":17},0,0,0,0,0,0,0,0,0,0,"　　　　　　　　　　　　　　　　　　　　　　　　　　　　　　　　　　　　　　　　　　　　　　","　　　　　　　　　　　　　　　　　　　　　　　　　　　　　　　　　　　　　　　　　　　　　　　　　　　　　　　　　　　　　　　　　　　　　　　　　　　　　　　　　　　　　　　　　　　　　　　　　　　　　　　　　　　　　　　　　　","　　　　　　　　　　　　　　　　　　　　　　　　　　　　　　　　　　　　　　　　　　　　　　　　　　　　　　　　　　　　　　　　　　　　　　　　　　　　　　　　　　　　　　　　　　　　　　　　　　　　　　　　　　　　　　　　　　　　　　　　　　　　　　　　　　　　　　　　　　　　　　　　　　　　　　　　　　　　　　　　　　　　　　　　　　　　　　　　　　　　　　　　　　　　","　　　　　　　　　　　　　　　　　　　　　　　　　　　　　　　　　　　　　　　　　　　　　　　　　　　　　　　　　　　　　　　　　　　　　　　　　　　　　　　　　　　　　　　　　　　　　　　　　　　　　　　　　　　　　　　　　　　　　　　　　　　　　　　　　　　　　　　　　　　　　　　　　　　　　　　　　　　　　　　　　　　　　　　　　　　　　　　　　　　　　　　　　　　　　　　　　　　　　　　　　　　　　　　　　　　　　　　　　　　　　　　　　　　　　　　　　　　　　　　　　　　　　　　　　　　　　　　　　　　　",0,0]
[null,{"$f":"COUNTIF($C$9:C45,TRUE)","v":21},false,12,{"$f":"IF(F45<$D$8,0,COUNTIF(F$9:$G45,'2ヶ月カレンダー (2)'!$D$21)+$D$8)","v":12},{"$f":"COUNTIF($G$9:G45,'2ヶ月カレンダー (2)'!$D$20)","v":8},"",null,"",{"$nulls":17},0,0,0,0,0,0,0,0,0,0,"　　　　　　　　　　　　　　　　　　　　　　　　　　　　　　　　　　　　　　　　　　　　　　","　　　　　　　　　　　　　　　　　　　　　　　　　　　　　　　　　　　　　　　　　　　　　　　　　　　　　　　　　　　　　　　　　　　　　　　　　　　　　　　　　　　　　　　　　　　　　　　　　　　　　　　　　　　　　　　　　　","　　　　　　　　　　　　　　　　　　　　　　　　　　　　　　　　　　　　　　　　　　　　　　　　　　　　　　　　　　　　　　　　　　　　　　　　　　　　　　　　　　　　　　　　　　　　　　　　　　　　　　　　　　　　　　　　　　　　　　　　　　　　　　　　　　　　　　　　　　　　　　　　　　　　　　　　　　　　　　　　　　　　　　　　　　　　　　　　　　　　　　　　　　　　","　　　　　　　　　　　　　　　　　　　　　　　　　　　　　　　　　　　　　　　　　　　　　　　　　　　　　　　　　　　　　　　　　　　　　　　　　　　　　　　　　　　　　　　　　　　　　　　　　　　　　　　　　　　　　　　　　　　　　　　　　　　　　　　　　　　　　　　　　　　　　　　　　　　　　　　　　　　　　　　　　　　　　　　　　　　　　　　　　　　　　　　　　　　　　　　　　　　　　　　　　　　　　　　　　　　　　　　　　　　　　　　　　　　　　　　　　　　　　　　　　　　　　　　　　　　　　　　　　　　　",0,0]
[null,{"$f":"COUNTIF($C$9:C46,TRUE)","v":21},false,12,{"$f":"IF(F46<$D$8,0,COUNTIF(F$9:$G46,'2ヶ月カレンダー (2)'!$D$21)+$D$8)","v":12},{"$f":"COUNTIF($G$9:G46,'2ヶ月カレンダー (2)'!$D$20)","v":8},"",null,"",{"$nulls":17},0,0,0,0,0,0,0,0,0,0,"　　　　　　　　　　　　　　　　　　　　　　　　　　　　　　　　　　　　　　　　　　　　　　","　　　　　　　　　　　　　　　　　　　　　　　　　　　　　　　　　　　　　　　　　　　　　　　　　　　　　　　　　　　　　　　　　　　　　　　　　　　　　　　　　　　　　　　　　　　　　　　　　　　　　　　　　　　　　　　　　　","　　　　　　　　　　　　　　　　　　　　　　　　　　　　　　　　　　　　　　　　　　　　　　　　　　　　　　　　　　　　　　　　　　　　　　　　　　　　　　　　　　　　　　　　　　　　　　　　　　　　　　　　　　　　　　　　　　　　　　　　　　　　　　　　　　　　　　　　　　　　　　　　　　　　　　　　　　　　　　　　　　　　　　　　　　　　　　　　　　　　　　　　　　　　","　　　　　　　　　　　　　　　　　　　　　　　　　　　　　　　　　　　　　　　　　　　　　　　　　　　　　　　　　　　　　　　　　　　　　　　　　　　　　　　　　　　　　　　　　　　　　　　　　　　　　　　　　　　　　　　　　　　　　　　　　　　　　　　　　　　　　　　　　　　　　　　　　　　　　　　　　　　　　　　　　　　　　　　　　　　　　　　　　　　　　　　　　　　　　　　　　　　　　　　　　　　　　　　　　　　　　　　　　　　　　　　　　　　　　　　　　　　　　　　　　　　　　　　　　　　　　　　　　　　　",0,0]
[null,{"$f":"COUNTIF($C$9:C47,TRUE)","v":21},false,12,{"$f":"IF(F47<$D$8,0,COUNTIF(F$9:$G47,'2ヶ月カレンダー (2)'!$D$21)+$D$8)","v":12},{"$f":"COUNTIF($G$9:G47,'2ヶ月カレンダー (2)'!$D$20)","v":8},"",null,"",{"$nulls":17},0,0,0,0,0,0,0,0,0,0,"　　　　　　　　　　　　　　　　　　　　　　　　　　　　　　　　　　　　　　　　　　　　　　","　　　　　　　　　　　　　　　　　　　　　　　　　　　　　　　　　　　　　　　　　　　　　　　　　　　　　　　　　　　　　　　　　　　　　　　　　　　　　　　　　　　　　　　　　　　　　　　　　　　　　　　　　　　　　　　　　　","　　　　　　　　　　　　　　　　　　　　　　　　　　　　　　　　　　　　　　　　　　　　　　　　　　　　　　　　　　　　　　　　　　　　　　　　　　　　　　　　　　　　　　　　　　　　　　　　　　　　　　　　　　　　　　　　　　　　　　　　　　　　　　　　　　　　　　　　　　　　　　　　　　　　　　　　　　　　　　　　　　　　　　　　　　　　　　　　　　　　　　　　　　　　","　　　　　　　　　　　　　　　　　　　　　　　　　　　　　　　　　　　　　　　　　　　　　　　　　　　　　　　　　　　　　　　　　　　　　　　　　　　　　　　　　　　　　　　　　　　　　　　　　　　　　　　　　　　　　　　　　　　　　　　　　　　　　　　　　　　　　　　　　　　　　　　　　　　　　　　　　　　　　　　　　　　　　　　　　　　　　　　　　　　　　　　　　　　　　　　　　　　　　　　　　　　　　　　　　　　　　　　　　　　　　　　　　　　　　　　　　　　　　　　　　　　　　　　　　　　　　　　　　　　　",0,0]
[null,{"$f":"COUNTIF($C$9:C48,TRUE)","v":21},false,12,{"$f":"IF(F48<$D$8,0,COUNTIF(F$9:$G48,'2ヶ月カレンダー (2)'!$D$21)+$D$8)","v":12},{"$f":"COUNTIF($G$9:G48,'2ヶ月カレンダー (2)'!$D$20)","v":8},"",null,"",{"$nulls":17},0,0,0,0,0,0,0,0,0,0,"　　　　　　　　　　　　　　　　　　　　　　　　　　　　　　　　　　　　　　　　　　　　　　","　　　　　　　　　　　　　　　　　　　　　　　　　　　　　　　　　　　　　　　　　　　　　　　　　　　　　　　　　　　　　　　　　　　　　　　　　　　　　　　　　　　　　　　　　　　　　　　　　　　　　　　　　　　　　　　　　　","　　　　　　　　　　　　　　　　　　　　　　　　　　　　　　　　　　　　　　　　　　　　　　　　　　　　　　　　　　　　　　　　　　　　　　　　　　　　　　　　　　　　　　　　　　　　　　　　　　　　　　　　　　　　　　　　　　　　　　　　　　　　　　　　　　　　　　　　　　　　　　　　　　　　　　　　　　　　　　　　　　　　　　　　　　　　　　　　　　　　　　　　　　　　","　　　　　　　　　　　　　　　　　　　　　　　　　　　　　　　　　　　　　　　　　　　　　　　　　　　　　　　　　　　　　　　　　　　　　　　　　　　　　　　　　　　　　　　　　　　　　　　　　　　　　　　　　　　　　　　　　　　　　　　　　　　　　　　　　　　　　　　　　　　　　　　　　　　　　　　　　　　　　　　　　　　　　　　　　　　　　　　　　　　　　　　　　　　　　　　　　　　　　　　　　　　　　　　　　　　　　　　　　　　　　　　　　　　　　　　　　　　　　　　　　　　　　　　　　　　　　　　　　　　　",0,0]
[null,{"$f":"COUNTIF($C$9:C49,TRUE)","v":21},false,12,{"$f":"IF(F49<$D$8,0,COUNTIF(F$9:$G49,'2ヶ月カレンダー (2)'!$D$21)+$D$8)","v":12},{"$f":"COUNTIF($G$9:G49,'2ヶ月カレンダー (2)'!$D$20)","v":8},"",null,"",{"$nulls":17},0,0,0,0,0,0,0,0,0,0,"　　　　　　　　　　　　　　　　　　　　　　　　　　　　　　　　　　　　　　　　　　　　　　","　　　　　　　　　　　　　　　　　　　　　　　　　　　　　　　　　　　　　　　　　　　　　　　　　　　　　　　　　　　　　　　　　　　　　　　　　　　　　　　　　　　　　　　　　　　　　　　　　　　　　　　　　　　　　　　　　　","　　　　　　　　　　　　　　　　　　　　　　　　　　　　　　　　　　　　　　　　　　　　　　　　　　　　　　　　　　　　　　　　　　　　　　　　　　　　　　　　　　　　　　　　　　　　　　　　　　　　　　　　　　　　　　　　　　　　　　　　　　　　　　　　　　　　　　　　　　　　　　　　　　　　　　　　　　　　　　　　　　　　　　　　　　　　　　　　　　　　　　　　　　　　","　　　　　　　　　　　　　　　　　　　　　　　　　　　　　　　　　　　　　　　　　　　　　　　　　　　　　　　　　　　　　　　　　　　　　　　　　　　　　　　　　　　　　　　　　　　　　　　　　　　　　　　　　　　　　　　　　　　　　　　　　　　　　　　　　　　　　　　　　　　　　　　　　　　　　　　　　　　　　　　　　　　　　　　　　　　　　　　　　　　　　　　　　　　　　　　　　　　　　　　　　　　　　　　　　　　　　　　　　　　　　　　　　　　　　　　　　　　　　　　　　　　　　　　　　　　　　　　　　　　　",0,0]
[null,{"$f":"COUNTIF($C$9:C50,TRUE)","v":21},false,12,{"$f":"IF(F50<$D$8,0,COUNTIF(F$9:$G50,'2ヶ月カレンダー (2)'!$D$21)+$D$8)","v":12},{"$f":"COUNTIF($G$9:G50,'2ヶ月カレンダー (2)'!$D$20)","v":8},"",null,"",{"$nulls":17},0,0,0,0,0,0,0,0,0,0,"　　　　　　　　　　　　　　　　　　　　　　　　　　　　　　　　　　　　　　　　　　　　　　","　　　　　　　　　　　　　　　　　　　　　　　　　　　　　　　　　　　　　　　　　　　　　　　　　　　　　　　　　　　　　　　　　　　　　　　　　　　　　　　　　　　　　　　　　　　　　　　　　　　　　　　　　　　　　　　　　　","　　　　　　　　　　　　　　　　　　　　　　　　　　　　　　　　　　　　　　　　　　　　　　　　　　　　　　　　　　　　　　　　　　　　　　　　　　　　　　　　　　　　　　　　　　　　　　　　　　　　　　　　　　　　　　　　　　　　　　　　　　　　　　　　　　　　　　　　　　　　　　　　　　　　　　　　　　　　　　　　　　　　　　　　　　　　　　　　　　　　　　　　　　　　","　　　　　　　　　　　　　　　　　　　　　　　　　　　　　　　　　　　　　　　　　　　　　　　　　　　　　　　　　　　　　　　　　　　　　　　　　　　　　　　　　　　　　　　　　　　　　　　　　　　　　　　　　　　　　　　　　　　　　　　　　　　　　　　　　　　　　　　　　　　　　　　　　　　　　　　　　　　　　　　　　　　　　　　　　　　　　　　　　　　　　　　　　　　　　　　　　　　　　　　　　　　　　　　　　　　　　　　　　　　　　　　　　　　　　　　　　　　　　　　　　　　　　　　　　　　　　　　　　　　　",0,0]
[null,{"$f":"COUNTIF($C$9:C51,TRUE)","v":21},false,12,{"$f":"IF(F51<$D$8,0,COUNTIF(F$9:$G51,'2ヶ月カレンダー (2)'!$D$21)+$D$8)","v":12},{"$f":"COUNTIF($G$9:G51,'2ヶ月カレンダー (2)'!$D$20)","v":8},"",null,"",{"$nulls":17},0,0,0,0,0,0,0,0,0,0,"　　　　　　　　　　　　　　　　　　　　　　　　　　　　　　　　　　　　　　　　　　　　　　","　　　　　　　　　　　　　　　　　　　　　　　　　　　　　　　　　　　　　　　　　　　　　　　　　　　　　　　　　　　　　　　　　　　　　　　　　　　　　　　　　　　　　　　　　　　　　　　　　　　　　　　　　　　　　　　　　　","　　　　　　　　　　　　　　　　　　　　　　　　　　　　　　　　　　　　　　　　　　　　　　　　　　　　　　　　　　　　　　　　　　　　　　　　　　　　　　　　　　　　　　　　　　　　　　　　　　　　　　　　　　　　　　　　　　　　　　　　　　　　　　　　　　　　　　　　　　　　　　　　　　　　　　　　　　　　　　　　　　　　　　　　　　　　　　　　　　　　　　　　　　　　","　　　　　　　　　　　　　　　　　　　　　　　　　　　　　　　　　　　　　　　　　　　　　　　　　　　　　　　　　　　　　　　　　　　　　　　　　　　　　　　　　　　　　　　　　　　　　　　　　　　　　　　　　　　　　　　　　　　　　　　　　　　　　　　　　　　　　　　　　　　　　　　　　　　　　　　　　　　　　　　　　　　　　　　　　　　　　　　　　　　　　　　　　　　　　　　　　　　　　　　　　　　　　　　　　　　　　　　　　　　　　　　　　　　　　　　　　　　　　　　　　　　　　　　　　　　　　　　　　　　　",0,0]
[null,{"$f":"COUNTIF($C$9:C52,TRUE)","v":21},false,12,{"$f":"IF(F52<$D$8,0,COUNTIF(F$9:$G52,'2ヶ月カレンダー (2)'!$D$21)+$D$8)","v":12},{"$f":"COUNTIF($G$9:G52,'2ヶ月カレンダー (2)'!$D$20)","v":8},"",null,"",{"$nulls":17},0,0,0,0,0,0,0,0,0,0,"　　　　　　　　　　　　　　　　　　　　　　　　　　　　　　　　　　　　　　　　　　　　　　","　　　　　　　　　　　　　　　　　　　　　　　　　　　　　　　　　　　　　　　　　　　　　　　　　　　　　　　　　　　　　　　　　　　　　　　　　　　　　　　　　　　　　　　　　　　　　　　　　　　　　　　　　　　　　　　　　　","　　　　　　　　　　　　　　　　　　　　　　　　　　　　　　　　　　　　　　　　　　　　　　　　　　　　　　　　　　　　　　　　　　　　　　　　　　　　　　　　　　　　　　　　　　　　　　　　　　　　　　　　　　　　　　　　　　　　　　　　　　　　　　　　　　　　　　　　　　　　　　　　　　　　　　　　　　　　　　　　　　　　　　　　　　　　　　　　　　　　　　　　　　　　","　　　　　　　　　　　　　　　　　　　　　　　　　　　　　　　　　　　　　　　　　　　　　　　　　　　　　　　　　　　　　　　　　　　　　　　　　　　　　　　　　　　　　　　　　　　　　　　　　　　　　　　　　　　　　　　　　　　　　　　　　　　　　　　　　　　　　　　　　　　　　　　　　　　　　　　　　　　　　　　　　　　　　　　　　　　　　　　　　　　　　　　　　　　　　　　　　　　　　　　　　　　　　　　　　　　　　　　　　　　　　　　　　　　　　　　　　　　　　　　　　　　　　　　　　　　　　　　　　　　　",0,0]
[null,{"$f":"COUNTIF($C$9:C53,TRUE)","v":21},false,12,{"$f":"IF(F53<$D$8,0,COUNTIF(F$9:$G53,'2ヶ月カレンダー (2)'!$D$21)+$D$8)","v":12},{"$f":"COUNTIF($G$9:G53,'2ヶ月カレンダー (2)'!$D$20)","v":8},"",null,"",{"$nulls":17},0,0,0,0,0,0,0,0,0,0,"　　　　　　　　　　　　　　　　　　　　　　　　　　　　　　　　　　　　　　　　　　　　　　","　　　　　　　　　　　　　　　　　　　　　　　　　　　　　　　　　　　　　　　　　　　　　　　　　　　　　　　　　　　　　　　　　　　　　　　　　　　　　　　　　　　　　　　　　　　　　　　　　　　　　　　　　　　　　　　　　　","　　　　　　　　　　　　　　　　　　　　　　　　　　　　　　　　　　　　　　　　　　　　　　　　　　　　　　　　　　　　　　　　　　　　　　　　　　　　　　　　　　　　　　　　　　　　　　　　　　　　　　　　　　　　　　　　　　　　　　　　　　　　　　　　　　　　　　　　　　　　　　　　　　　　　　　　　　　　　　　　　　　　　　　　　　　　　　　　　　　　　　　　　　　　","　　　　　　　　　　　　　　　　　　　　　　　　　　　　　　　　　　　　　　　　　　　　　　　　　　　　　　　　　　　　　　　　　　　　　　　　　　　　　　　　　　　　　　　　　　　　　　　　　　　　　　　　　　　　　　　　　　　　　　　　　　　　　　　　　　　　　　　　　　　　　　　　　　　　　　　　　　　　　　　　　　　　　　　　　　　　　　　　　　　　　　　　　　　　　　　　　　　　　　　　　　　　　　　　　　　　　　　　　　　　　　　　　　　　　　　　　　　　　　　　　　　　　　　　　　　　　　　　　　　　",0,0]
[null,{"$f":"COUNTIF($C$9:C54,TRUE)","v":21},false,12,{"$f":"IF(F54<$D$8,0,COUNTIF(F$9:$G54,'2ヶ月カレンダー (2)'!$D$21)+$D$8)","v":12},{"$f":"COUNTIF($G$9:G54,'2ヶ月カレンダー (2)'!$D$20)","v":8},"",null,"",{"$nulls":17},0,0,0,0,0,0,0,0,0,0,"　　　　　　　　　　　　　　　　　　　　　　　　　　　　　　　　　　　　　　　　　　　　　　","　　　　　　　　　　　　　　　　　　　　　　　　　　　　　　　　　　　　　　　　　　　　　　　　　　　　　　　　　　　　　　　　　　　　　　　　　　　　　　　　　　　　　　　　　　　　　　　　　　　　　　　　　　　　　　　　　　","　　　　　　　　　　　　　　　　　　　　　　　　　　　　　　　　　　　　　　　　　　　　　　　　　　　　　　　　　　　　　　　　　　　　　　　　　　　　　　　　　　　　　　　　　　　　　　　　　　　　　　　　　　　　　　　　　　　　　　　　　　　　　　　　　　　　　　　　　　　　　　　　　　　　　　　　　　　　　　　　　　　　　　　　　　　　　　　　　　　　　　　　　　　　","　　　　　　　　　　　　　　　　　　　　　　　　　　　　　　　　　　　　　　　　　　　　　　　　　　　　　　　　　　　　　　　　　　　　　　　　　　　　　　　　　　　　　　　　　　　　　　　　　　　　　　　　　　　　　　　　　　　　　　　　　　　　　　　　　　　　　　　　　　　　　　　　　　　　　　　　　　　　　　　　　　　　　　　　　　　　　　　　　　　　　　　　　　　　　　　　　　　　　　　　　　　　　　　　　　　　　　　　　　　　　　　　　　　　　　　　　　　　　　　　　　　　　　　　　　　　　　　　　　　　",0,0]
[null,{"$f":"COUNTIF($C$9:C55,TRUE)","v":21},false,12,{"$f":"IF(F55<$D$8,0,COUNTIF(F$9:$G55,'2ヶ月カレンダー (2)'!$D$21)+$D$8)","v":12},{"$f":"COUNTIF($G$9:G55,'2ヶ月カレンダー (2)'!$D$20)","v":8},"",null,"",{"$nulls":17},0,0,0,0,0,0,0,0,0,0,"　　　　　　　　　　　　　　　　　　　　　　　　　　　　　　　　　　　　　　　　　　　　　　","　　　　　　　　　　　　　　　　　　　　　　　　　　　　　　　　　　　　　　　　　　　　　　　　　　　　　　　　　　　　　　　　　　　　　　　　　　　　　　　　　　　　　　　　　　　　　　　　　　　　　　　　　　　　　　　　　　","　　　　　　　　　　　　　　　　　　　　　　　　　　　　　　　　　　　　　　　　　　　　　　　　　　　　　　　　　　　　　　　　　　　　　　　　　　　　　　　　　　　　　　　　　　　　　　　　　　　　　　　　　　　　　　　　　　　　　　　　　　　　　　　　　　　　　　　　　　　　　　　　　　　　　　　　　　　　　　　　　　　　　　　　　　　　　　　　　　　　　　　　　　　　","　　　　　　　　　　　　　　　　　　　　　　　　　　　　　　　　　　　　　　　　　　　　　　　　　　　　　　　　　　　　　　　　　　　　　　　　　　　　　　　　　　　　　　　　　　　　　　　　　　　　　　　　　　　　　　　　　　　　　　　　　　　　　　　　　　　　　　　　　　　　　　　　　　　　　　　　　　　　　　　　　　　　　　　　　　　　　　　　　　　　　　　　　　　　　　　　　　　　　　　　　　　　　　　　　　　　　　　　　　　　　　　　　　　　　　　　　　　　　　　　　　　　　　　　　　　　　　　　　　　　",0,0]
[null,{"$f":"COUNTIF($C$9:C56,TRUE)","v":21},false,12,{"$f":"IF(F56<$D$8,0,COUNTIF(F$9:$G56,'2ヶ月カレンダー (2)'!$D$21)+$D$8)","v":12},{"$f":"COUNTIF($G$9:G56,'2ヶ月カレンダー (2)'!$D$20)","v":8},"",null,"",{"$nulls":17},0,0,0,0,0,0,0,0,0,0,"　　　　　　　　　　　　　　　　　　　　　　　　　　　　　　　　　　　　　　　　　　　　　　","　　　　　　　　　　　　　　　　　　　　　　　　　　　　　　　　　　　　　　　　　　　　　　　　　　　　　　　　　　　　　　　　　　　　　　　　　　　　　　　　　　　　　　　　　　　　　　　　　　　　　　　　　　　　　　　　　　","　　　　　　　　　　　　　　　　　　　　　　　　　　　　　　　　　　　　　　　　　　　　　　　　　　　　　　　　　　　　　　　　　　　　　　　　　　　　　　　　　　　　　　　　　　　　　　　　　　　　　　　　　　　　　　　　　　　　　　　　　　　　　　　　　　　　　　　　　　　　　　　　　　　　　　　　　　　　　　　　　　　　　　　　　　　　　　　　　　　　　　　　　　　　","　　　　　　　　　　　　　　　　　　　　　　　　　　　　　　　　　　　　　　　　　　　　　　　　　　　　　　　　　　　　　　　　　　　　　　　　　　　　　　　　　　　　　　　　　　　　　　　　　　　　　　　　　　　　　　　　　　　　　　　　　　　　　　　　　　　　　　　　　　　　　　　　　　　　　　　　　　　　　　　　　　　　　　　　　　　　　　　　　　　　　　　　　　　　　　　　　　　　　　　　　　　　　　　　　　　　　　　　　　　　　　　　　　　　　　　　　　　　　　　　　　　　　　　　　　　　　　　　　　　　",0,0]
[null,{"$f":"COUNTIF($C$9:C57,TRUE)","v":21},false,12,{"$f":"IF(F57<$D$8,0,COUNTIF(F$9:$G57,'2ヶ月カレンダー (2)'!$D$21)+$D$8)","v":12},{"$f":"COUNTIF($G$9:G57,'2ヶ月カレンダー (2)'!$D$20)","v":8},"",null,"",{"$nulls":17},0,0,0,0,0,0,0,0,0,0,"　　　　　　　　　　　　　　　　　　　　　　　　　　　　　　　　　　　　　　　　　　　　　　","　　　　　　　　　　　　　　　　　　　　　　　　　　　　　　　　　　　　　　　　　　　　　　　　　　　　　　　　　　　　　　　　　　　　　　　　　　　　　　　　　　　　　　　　　　　　　　　　　　　　　　　　　　　　　　　　　　","　　　　　　　　　　　　　　　　　　　　　　　　　　　　　　　　　　　　　　　　　　　　　　　　　　　　　　　　　　　　　　　　　　　　　　　　　　　　　　　　　　　　　　　　　　　　　　　　　　　　　　　　　　　　　　　　　　　　　　　　　　　　　　　　　　　　　　　　　　　　　　　　　　　　　　　　　　　　　　　　　　　　　　　　　　　　　　　　　　　　　　　　　　　　","　　　　　　　　　　　　　　　　　　　　　　　　　　　　　　　　　　　　　　　　　　　　　　　　　　　　　　　　　　　　　　　　　　　　　　　　　　　　　　　　　　　　　　　　　　　　　　　　　　　　　　　　　　　　　　　　　　　　　　　　　　　　　　　　　　　　　　　　　　　　　　　　　　　　　　　　　　　　　　　　　　　　　　　　　　　　　　　　　　　　　　　　　　　　　　　　　　　　　　　　　　　　　　　　　　　　　　　　　　　　　　　　　　　　　　　　　　　　　　　　　　　　　　　　　　　　　　　　　　　　",0,0]
[null,{"$f":"COUNTIF($C$9:C58,TRUE)","v":21},false,12,{"$f":"IF(F58<$D$8,0,COUNTIF(F$9:$G58,'2ヶ月カレンダー (2)'!$D$21)+$D$8)","v":12},{"$f":"COUNTIF($G$9:G58,'2ヶ月カレンダー (2)'!$D$20)","v":8},"",null,"",{"$nulls":17},0,0,0,0,0,0,0,0,0,0,"　　　　　　　　　　　　　　　　　　　　　　　　　　　　　　　　　　　　　　　　　　　　　　","　　　　　　　　　　　　　　　　　　　　　　　　　　　　　　　　　　　　　　　　　　　　　　　　　　　　　　　　　　　　　　　　　　　　　　　　　　　　　　　　　　　　　　　　　　　　　　　　　　　　　　　　　　　　　　　　　　","　　　　　　　　　　　　　　　　　　　　　　　　　　　　　　　　　　　　　　　　　　　　　　　　　　　　　　　　　　　　　　　　　　　　　　　　　　　　　　　　　　　　　　　　　　　　　　　　　　　　　　　　　　　　　　　　　　　　　　　　　　　　　　　　　　　　　　　　　　　　　　　　　　　　　　　　　　　　　　　　　　　　　　　　　　　　　　　　　　　　　　　　　　　　","　　　　　　　　　　　　　　　　　　　　　　　　　　　　　　　　　　　　　　　　　　　　　　　　　　　　　　　　　　　　　　　　　　　　　　　　　　　　　　　　　　　　　　　　　　　　　　　　　　　　　　　　　　　　　　　　　　　　　　　　　　　　　　　　　　　　　　　　　　　　　　　　　　　　　　　　　　　　　　　　　　　　　　　　　　　　　　　　　　　　　　　　　　　　　　　　　　　　　　　　　　　　　　　　　　　　　　　　　　　　　　　　　　　　　　　　　　　　　　　　　　　　　　　　　　　　　　　　　　　　",0,0]
[null,{"$f":"COUNTIF($C$9:C59,TRUE)","v":21},false,12,{"$f":"IF(F59<$D$8,0,COUNTIF(F$9:$G59,'2ヶ月カレンダー (2)'!$D$21)+$D$8)","v":12},{"$f":"COUNTIF($G$9:G59,'2ヶ月カレンダー (2)'!$D$20)","v":8},"",null,"",{"$nulls":17},0,0,0,0,0,0,0,0,0,0,"　　　　　　　　　　　　　　　　　　　　　　　　　　　　　　　　　　　　　　　　　　　　　　","　　　　　　　　　　　　　　　　　　　　　　　　　　　　　　　　　　　　　　　　　　　　　　　　　　　　　　　　　　　　　　　　　　　　　　　　　　　　　　　　　　　　　　　　　　　　　　　　　　　　　　　　　　　　　　　　　　","　　　　　　　　　　　　　　　　　　　　　　　　　　　　　　　　　　　　　　　　　　　　　　　　　　　　　　　　　　　　　　　　　　　　　　　　　　　　　　　　　　　　　　　　　　　　　　　　　　　　　　　　　　　　　　　　　　　　　　　　　　　　　　　　　　　　　　　　　　　　　　　　　　　　　　　　　　　　　　　　　　　　　　　　　　　　　　　　　　　　　　　　　　　　","　　　　　　　　　　　　　　　　　　　　　　　　　　　　　　　　　　　　　　　　　　　　　　　　　　　　　　　　　　　　　　　　　　　　　　　　　　　　　　　　　　　　　　　　　　　　　　　　　　　　　　　　　　　　　　　　　　　　　　　　　　　　　　　　　　　　　　　　　　　　　　　　　　　　　　　　　　　　　　　　　　　　　　　　　　　　　　　　　　　　　　　　　　　　　　　　　　　　　　　　　　　　　　　　　　　　　　　　　　　　　　　　　　　　　　　　　　　　　　　　　　　　　　　　　　　　　　　　　　　　",0,0]
[null,{"$f":"COUNTIF($C$9:C60,TRUE)","v":21},false,12,{"$f":"IF(F60<$D$8,0,COUNTIF(F$9:$G60,'2ヶ月カレンダー (2)'!$D$21)+$D$8)","v":12},{"$f":"COUNTIF($G$9:G60,'2ヶ月カレンダー (2)'!$D$20)","v":8},"",null,"",{"$nulls":17},0,0,0,0,0,0,0,0,0,0,"　　　　　　　　　　　　　　　　　　　　　　　　　　　　　　　　　　　　　　　　　　　　　　","　　　　　　　　　　　　　　　　　　　　　　　　　　　　　　　　　　　　　　　　　　　　　　　　　　　　　　　　　　　　　　　　　　　　　　　　　　　　　　　　　　　　　　　　　　　　　　　　　　　　　　　　　　　　　　　　　　","　　　　　　　　　　　　　　　　　　　　　　　　　　　　　　　　　　　　　　　　　　　　　　　　　　　　　　　　　　　　　　　　　　　　　　　　　　　　　　　　　　　　　　　　　　　　　　　　　　　　　　　　　　　　　　　　　　　　　　　　　　　　　　　　　　　　　　　　　　　　　　　　　　　　　　　　　　　　　　　　　　　　　　　　　　　　　　　　　　　　　　　　　　　　","　　　　　　　　　　　　　　　　　　　　　　　　　　　　　　　　　　　　　　　　　　　　　　　　　　　　　　　　　　　　　　　　　　　　　　　　　　　　　　　　　　　　　　　　　　　　　　　　　　　　　　　　　　　　　　　　　　　　　　　　　　　　　　　　　　　　　　　　　　　　　　　　　　　　　　　　　　　　　　　　　　　　　　　　　　　　　　　　　　　　　　　　　　　　　　　　　　　　　　　　　　　　　　　　　　　　　　　　　　　　　　　　　　　　　　　　　　　　　　　　　　　　　　　　　　　　　　　　　　　　",0,0]
[null,{"$f":"COUNTIF($C$9:C61,TRUE)","v":21},false,12,{"$f":"IF(F61<$D$8,0,COUNTIF(F$9:$G61,'2ヶ月カレンダー (2)'!$D$21)+$D$8)","v":12},{"$f":"COUNTIF($G$9:G61,'2ヶ月カレンダー (2)'!$D$20)","v":8},"",null,"",{"$nulls":17},0,0,0,0,0,0,0,0,0,0,"　　　　　　　　　　　　　　　　　　　　　　　　　　　　　　　　　　　　　　　　　　　　　　","　　　　　　　　　　　　　　　　　　　　　　　　　　　　　　　　　　　　　　　　　　　　　　　　　　　　　　　　　　　　　　　　　　　　　　　　　　　　　　　　　　　　　　　　　　　　　　　　　　　　　　　　　　　　　　　　　　","　　　　　　　　　　　　　　　　　　　　　　　　　　　　　　　　　　　　　　　　　　　　　　　　　　　　　　　　　　　　　　　　　　　　　　　　　　　　　　　　　　　　　　　　　　　　　　　　　　　　　　　　　　　　　　　　　　　　　　　　　　　　　　　　　　　　　　　　　　　　　　　　　　　　　　　　　　　　　　　　　　　　　　　　　　　　　　　　　　　　　　　　　　　　","　　　　　　　　　　　　　　　　　　　　　　　　　　　　　　　　　　　　　　　　　　　　　　　　　　　　　　　　　　　　　　　　　　　　　　　　　　　　　　　　　　　　　　　　　　　　　　　　　　　　　　　　　　　　　　　　　　　　　　　　　　　　　　　　　　　　　　　　　　　　　　　　　　　　　　　　　　　　　　　　　　　　　　　　　　　　　　　　　　　　　　　　　　　　　　　　　　　　　　　　　　　　　　　　　　　　　　　　　　　　　　　　　　　　　　　　　　　　　　　　　　　　　　　　　　　　　　　　　　　　",0,0]
[null,{"$f":"COUNTIF($C$9:C62,TRUE)","v":21},false,12,{"$f":"IF(F62<$D$8,0,COUNTIF(F$9:$G62,'2ヶ月カレンダー (2)'!$D$21)+$D$8)","v":12},{"$f":"COUNTIF($G$9:G62,'2ヶ月カレンダー (2)'!$D$20)","v":8},"",null,"",{"$nulls":17},0,0,0,0,0,0,0,0,0,0,"　　　　　　　　　　　　　　　　　　　　　　　　　　　　　　　　　　　　　　　　　　　　　　","　　　　　　　　　　　　　　　　　　　　　　　　　　　　　　　　　　　　　　　　　　　　　　　　　　　　　　　　　　　　　　　　　　　　　　　　　　　　　　　　　　　　　　　　　　　　　　　　　　　　　　　　　　　　　　　　　　","　　　　　　　　　　　　　　　　　　　　　　　　　　　　　　　　　　　　　　　　　　　　　　　　　　　　　　　　　　　　　　　　　　　　　　　　　　　　　　　　　　　　　　　　　　　　　　　　　　　　　　　　　　　　　　　　　　　　　　　　　　　　　　　　　　　　　　　　　　　　　　　　　　　　　　　　　　　　　　　　　　　　　　　　　　　　　　　　　　　　　　　　　　　　",{"$f":"IF(H62=#REF!,AM62&\"　　　　　　　　　　　　　　　　　　　　　　　　　　\"&#REF!,AM62)","v":{"$error":"#REF!"}},0,0]
[null,{"$f":"COUNTIF($C$9:C63,TRUE)","v":21},false,12,{"$f":"IF(F63<$D$8,0,COUNTIF(F$9:$G63,'2ヶ月カレンダー (2)'!$D$21)+$D$8)","v":12},{"$f":"COUNTIF($G$9:G63,'2ヶ月カレンダー (2)'!$D$20)","v":8},"",null,"",{"$nulls":17},0,0,0,0,0,0,0,0,0,0,"　　　　　　　　　　　　　　　　　　　　　　　　　　　　　　　　　　　　　　　　　　　　　　","　　　　　　　　　　　　　　　　　　　　　　　　　　　　　　　　　　　　　　　　　　　　　　　　　　　　　　　　　　　　　　　　　　　　　　　　　　　　　　　　　　　　　　　　　　　　　　　　　　　　　　　　　　　　　　　　　　",{"$f":"IF(H63=#REF!,AL63&\"　　　　　　　　　　　　　　　　　　　　　　　　　　　　\"&#REF!,AL63)","v":{"$error":"#REF!"}},{"$f":"IF(H63=#REF!,AM63&\"　　　　　　　　　　　　　　　　　　　　　　　　　　\"&#REF!,AM63)","v":{"$error":"#REF!"}},0,0]
[null,{"$f":"COUNTIF($C$9:C64,TRUE)","v":21},false,12,{"$f":"IF(F64<$D$8,0,COUNTIF(F$9:$G64,'2ヶ月カレンダー (2)'!$D$21)+$D$8)","v":12},{"$f":"COUNTIF($G$9:G64,'2ヶ月カレンダー (2)'!$D$20)","v":8},"",null,"",{"$nulls":17},0,0,0,0,0,0,0,0,0,0,"　　　　　　　　　　　　　　　　　　　　　　　　　　　　　　　　　　　　　　　　　　　　　　",{"$f":"IF(H64=#REF!,AK64&\"　　　　　　　　　　　　　　　　　　　　　　\"&#REF!,AK64)","v":{"$error":"#REF!"}},{"$f":"IF(H64=#REF!,AL64&\"　　　　　　　　　　　　　　　　　　　　　　　　　　　　\"&#REF!,AL64)","v":{"$error":"#REF!"}},{"$f":"IF(H64=#REF!,AM64&\"　　　　　　　　　　　　　　　　　　　　　　　　　　\"&#REF!,AM64)","v":{"$error":"#REF!"}},0,0]

{"sheet":"2ヶ月カレンダー (2)","index":3,"n_rows":53,"n_cols":81,"rows_kept":53,"merged":[[1,7,1,8],[1,9,1,10],[1,11,2,21],[2,7,2,8],[2,9,2,10],[4,7,4,8],[4,9,4,10],[4,11,4,17],[4,18,4,23],[4,37,4,42],[4,43,4,48],[4,49,4,60],[4,61,4,66],[5,7,5,8],[5,9,5,10],[5,12,5,17],[5,18,5,23],[5,24,5,29],[5,30,5,35],[5,37,5,42],[5,43,5,48],[5,49,5,54],[5,55,5,60],[5,61,5,66],[5,67,5,72],[5,73,5,78],[6,7,6,8],[6,9,6,10],[6,12,6,17],[6,18,6,23],[6,24,6,29],[6,30,6,35],[6,37,6,42],[6,43,6,48],[6,49,6,54],[6,55,6,60],[6,61,6,66],[6,67,6,72],[6,73,6,78],[7,7,7,8],[7,9,7,10],[7,12,7,17],[7,18,7,23],[7,24,7,29],[7,30,7,35],[7,37,7,42],[7,43,7,48],[7,49,7,54],[7,55,7,60],[7,61,7,66],[7,67,7,72],[7,73,7,78],[8,7,8,8],[8,9,8,10],[8,12,8,17],[8,18,8,23],[8,24,8,29],[8,30,8,35],[8,37,8,42],[8,43,8,48],[8,49,8,54],[8,55,8,60],[8,61,8,66],[8,67,8,72],[8,73,8,78],[9,7,9,8],[9,9,9,10],[9,12,9,17],[9,18,9,23],[9,24,9,29],[9,30,9,35],[9,37,9,42],[9,43,9,48],[9,49,9,54],[9,55,9,60],[9,61,9,66],[9,67,9,72],[9,73,9,78],[10,7,10,8],[10,9,10,10],[10,12,10,17],[10,18,10,23],[10,24,10,29],[10,30,10,35],[10,37,10,42],[10,43,10,48],[10,49,10,54],[10,55,10,60],[10,61,10,66],[10,67,10,72],[10,73,10,78],[11,7,11,8],[11,9,11,10],[11,12,11,17],[11,18,11,23],[11,24,11,29],[11,30,11,35],[11,37,11,42],[11,43,11,48],[11,49,11,54],[11,55,11,60],[11,61,11,66],[11,67,11,72],[11,73,11,78],[12,7,12,8],[12,9,12,10],[12,12,12,17],[12,18,12,23],[12,24,12,29],[12,30,12,35],[12,37,12,42],[12,43,12,48],[12,49,12,54],[12,55,12,60],[12,61,12,66],[12,67,12,72],[12,73,12,78],[13,7,13,8],[13,9,13,10],[13,12,13,17],[13,18,13,23],[13,24,13,29],[13,30,13,35],[13,37,13,42],[13,43,13,48],[13,49,13,54],[13,55,13,60],[13,61,13,66],[13,67,13,72],[13,73,13,78],[14,7,14,8],[14,9,14,10],[14,12,14,17],[14,18,14,23],[14,24,14,29],[14,30,14,35],[14,37,14,42],[14,43,14,48],[14,49,14,54],[14,55,14,60],[14,61,14,66],[14,67,14,72],[14,73,14,78],[15,7,15,8],[15,9,15,10],[15,12,15,17],[15,18,15,23],[15,24,15,29],[15,30,15,35],[15,37,15,42],[15,43,15,48],[15,49,15,54],[15,55,15,60],[15,61,15,66],[15,67,15,72],[15,73,15,78],[16,7,16,8],[16,9,16,10],[16,12,16,17],[16,18,16,23],[16,24,16,29],[16,30,16,35],[16,37,16,42],[16,43,16,48],[16,49,16,54],[16,55,16,60],[16,61,16,66],[16,67,16,72],[16,73,16,78],[17,7,17,8],[17,9,17,10],[17,12,17,17],[17,18,17,23],[17,24,17,29],[17,30,17,35],[17,37,17,42],[17,43,17,48],[17,49,17,54],[17,55,17,60],[17,61,17,66],[17,67,17,72],[17,73,17,78],[19,7,20,10],[19,11,20,16],[19,17,19,47],[19,48,19,78],[21,7,21,10],[21,11,21,16],[22,7,22,10],[22,11,22,16],[23,7,23,10],[23,11,23,16],[24,7,24,10],[24,11,24,16],[25,7,25,10],[25,11,25,16],[26,7,26,10],[26,11,26,16],[27,7,27,10],[27,11,27,16],[28,7,28,10],[28,11,28,16],[29,7,29,10],[29,11,29,16],[30,7,30,10],[30,11,30,16],[31,7,31,10],[31,11,31,16],[32,7,32,10],[32,11,32,16],[33,7,33,10],[33,11,33,16],[34,7,34,10],[34,11,34,16],[35,7,35,10],[35,11,35,16],[36,7,36,10],[36,11,36,16],[37,7,37,10],[37,11,37,16],[38,7,38,10],[38,11,38,16],[39,7,39,10],[39,11,39,16],[40,7,40,10],[40,11,40,16],[41,7,41,10],[41,11,41,16],[42,7,42,10],[42,11,42,16],[43,7,43,10],[43,11,43,16],[44,7,44,10],[44,11,44,16],[45,7,45,10],[45,11,45,16],[46,7,46,10],[46,11,46,16],[47,7,47,10],[47,11,47,16],[48,7,48,10],[48,11,48,16],[49,7,49,10],[49,11,49,16],[50,7,50,10],[50,11,50,16],[51,7,51,10],[51,11,51,16],[52,7,52,10],[52,11,52,16]]}
[{"$nulls":7},{"$f":"H3","v":9},{"$f":"J3","v":10}]
[{"$nulls":7},2021,null,2021,null,"←表示したい年月を入力"]
[{"$nulls":7},9,null,10]
[]
[{"$nulls":7},{"$f":"H2","v":2021},null,{"$f":"H3","v":9},null,{"$f":"DATE(H5,J5,1)","v":"2021-09-01"},{"$nulls":6},{"$f":"WEEKDAY(L5,1)","v":4},{"$nulls":18},{"$f":"J2","v":2021},{"$nulls":5},{"$f":"J3","v":10},{"$nulls":5},{"$f":"DATE(AL5,AR5,1)","v":"2021-10-01"},{"$nulls":11},{"$f":"WEEKDAY(AX5,1)","v":6}]
[{"$nulls":7},"日",null,"月",null,"火","水",{"$nulls":5},"木",{"$nulls":5},"金",{"$nulls":5},"土",{"$nulls":6},"日",{"$nulls":5},"月",{"$nulls":5},"火",{"$nulls":5},"水",{"$nulls":5},"木",{"$nulls":5},"金",{"$nulls":5},"土"]
[{"$nulls":7},{"$f":"L5-(S5-1)","v":"2021-08-29"},null,{"$f":"H7+1","v":"2021-08-30"},null,{"$f":"J7+1","v":"2021-08-31"},{"$f":"L7+1","v":"2021-09-01"},{"$nulls":5},{"$f":"M7+1","v":"2021-09-02"},{"$nulls":5},{"$f":"S7+1","v":"2021-09-03"},{"$nulls":5},{"$f":"Y7+1","v":"2021-09-04"},{"$nulls":6},{"$f":"AX5-(BJ5-1)","v":"2021-09-26"},{"$nulls":5},{"$f":"AL7+1","v":"2021-09-27"},{"$nulls":5},{"$f":"AR7+1","v":"2021-09-28"},{"$nulls":5},{"$f":"AX7+1","v":"2021-09-29"},{"$nulls":5},{"$f":"BD7+1","v":"2021-09-30"},{"$nulls":5},{"$f":"BJ7+1","v":"2021-10-01"},{"$nulls":5},{"$f":"BP7+1","v":"2021-10-02"}]
[{"$nulls":7},{"$f":"IFERROR(VLOOKUP(H7,年度の予定・記録!$H:$AN,31,FALSE),\"\")","v":""},null,{"$f":"IFERROR(VLOOKUP(J7,年度の予定・記録!$H:$AN,31,FALSE),\"\")","v":""},null,{"$f":"IFERROR(VLOOKUP(L7,年度の予定・記録!$H:$AN,31,FALSE),\"\")","v":""},{"$f":"IFERROR(VLOOKUP(M7,年度の予定・記録!$H:$AN,31,FALSE),\"\")","v":""},{"$nulls":5},{"$f":"IFERROR(VLOOKUP(S7,年度の予定・記録!$H:$AN,31,FALSE),\"\")","v":""},{"$nulls":5},{"$f":"IFERROR(VLOOKUP(Y7,年度の予定・記録!$H:$AN,31,FALSE),\"\")","v":""},{"$nulls":5},{"$f":"IFERROR(VLOOKUP(AE7,年度の予定・記録!$H:$AN,31,FALSE),\"\")","v":""},{"$nulls":6},{"$f":"IFERROR(VLOOKUP(AL7,年度の予定・記録!$H:$AN,31,FALSE),\"\")","v":""},{"$nulls":5},{"$f":"IFERROR(VLOOKUP(AR7,年度の予定・記録!$H:$AN,31,FALSE),\"\")","v":""},{"$nulls":5},{"$f":"IFERROR(VLOOKUP(AX7,年度の予定・記録!$H:$AN,31,FALSE),\"\")","v":""},{"$nulls":5},{"$f":"IFERROR(VLOOKUP(BD7,年度の予定・記録!$H:$AN,31,FALSE),\"\")","v":""},{"$nulls":5},{"$f":"IFERROR(VLOOKUP(BJ7,年度の予定・記録!$H:$AN,31,FALSE),\"\")","v":""},{"$nulls":5},{"$f":"IFERROR(VLOOKUP(BP7,年度の予定・記録!$H:$AN,31,FALSE),\"\")","v":""},{"$nulls":5},{"$f":"IFERROR(VLOOKUP(BV7,年度の予定・記録!$H:$AN,31,FALSE),\"\")","v":""}]
[{"$nulls":7},{"$f":"AE7+1","v":"2021-09-05"},null,{"$f":"H9+1","v":"2021-09-06"},null,{"$f":"J9+1","v":"2021-09-07"},{"$f":"L9+1","v":"2021-09-08"},{"$nulls":5},{"$f":"M9+1","v":"2021-09-09"},{"$nulls":5},{"$f":"S9+1","v":"2021-09-10"},{"$nulls":5},{"$f":"Y9+1","v":"2021-09-11"},{"$nulls":6},{"$f":"BV7+1","v":"2021-10-03"},{"$nulls":5},{"$f":"AL9+1","v":"2021-10-04"},{"$nulls":5},{"$f":"AR9+1","v":"2021-10-05"},{"$nulls":5},{"$f":"AX9+1","v":"2021-10-06"},{"$nulls":5},{"$f":"BD9+1","v":"2021-10-07"},{"$nulls":5},{"$f":"BJ9+1","v":"2021-10-08"},{"$nulls":5},{"$f":"BP9+1","v":"2021-10-09"}]
[{"$nulls":7},{"$f":"IFERROR(VLOOKUP(H9,年度の予定・記録!$H:$AN,31,FALSE),\"\")","v":""},null,{"$f":"IFERROR(VLOOKUP(J9,年度の予定・記録!$H:$AN,31,FALSE),\"\")","v":""},null,{"$f":"IFERROR(VLOOKUP(L9,年度の予定・記録!$H:$AN,31,FALSE),\"\")","v":""},{"$f":"IFERROR(VLOOKUP(M9,年度の予定・記録!$H:$AN,31,FALSE),\"\")","v":""},{"$nulls":5},{"$f":"IFERROR(VLOOKUP(S9,年度の予定・記録!$H:$AN,31,FALSE),\"\")","v":""},{"$nulls":5},{"$f":"IFERROR(VLOOKUP(Y9,年度の予定・記録!$H:$AN,31,FALSE),\"\")","v":"分会交付金　振込日　　　　　　　　　　　　　　　　　　　　　　　　　　　　　　　　　　　　　　　　　　　　　　本部より交付金入金"},{"$nulls":5},{"$f":"IFERROR(VLOOKUP(AE9,年度の予定・記録!$H:$AN,31,FALSE),\"\")","v":""},{"$nulls":6},{"$f":"IFERROR(VLOOKUP(AL9,年度の予定・記録!$H:$AN,31,FALSE),\"\")","v":""},{"$nulls":5},{"$f":"IFERROR(VLOOKUP(AR9,年度の予定・記録!$H:$AN,31,FALSE),\"\")","v":""},{"$nulls":5},{"$f":"IFERROR(VLOOKUP(AX9,年度の予定・記録!$H:$AN,31,FALSE),\"\")","v":""},{"$nulls":5},{"$f":"IFERROR(VLOOKUP(BD9,年度の予定・記録!$H:$AN,31,FALSE),\"\")","v":""},{"$nulls":5},{"$f":"IFERROR(VLOOKUP(BJ9,年度の予定・記録!$H:$AN,31,FALSE),\"\")","v":""},{"$nulls":5},{"$f":"IFERROR(VLOOKUP(BP9,年度の予定・記録!$H:$AN,31,FALSE),\"\")","v":""},{"$nulls":5},{"$f":"IFERROR(VLOOKUP(BV9,年度の予定・記録!$H:$AN,31,FALSE),\"\")","v":""}]
[{"$nulls":7},{"$f":"AE9+1","v":"2021-09-12"},null,{"$f":"H11+1","v":"2021-09-13"},null,{"$f":"J11+1","v":"2021-09-14"},{"$f":"L11+1","v":"2021-09-15"},{"$nulls":5},{"$f":"M11+1","v":"2021-09-16"},{"$nulls":5},{"$f":"S11+1","v":"2021-09-17"},{"$nulls":5},{"$f":"Y11+1","v":"2021-09-18"},{"$nulls":6},{"$f":"BV9+1","v":"2021-10-10"},{"$nulls":5},{"$f":"AL11+1","v":"2021-10-11"},{"$nulls":5},{"$f":"AR11+1","v":"2021-10-12"},{"$nulls":5},{"$f":"AX11+1","v":"2021-10-13"},{"$nulls":5},{"$f":"BD11+1","v":"2021-10-14"},{"$nulls":5},{"$f":"BJ11+1","v":"2021-10-15"},{"$nulls":5},{"$f":"BP11+1","v":"2021-10-16"}]
[{"$nulls":7},{"$f":"IFERROR(VLOOKUP(H11,年度の予定・記録!$H:$AN,31,FALSE),\"\")","v":"第1回分会執行委員会　　　　　　　　　　　　　　　　　　　　　　　　　　　　　　　　　　　　　　　　　　　　　　食事代（5名分)"},null,{"$f":"IFERROR(VLOOKUP(J11,年度の予定・記録!$H:$AN,31,FALSE),\"\")","v":""},null,{"$f":"IFERROR(VLOOKUP(L11,年度の予定・記録!$H:$AN,31,FALSE),\"\")","v":"分会大会　　　　　　　　　　　　　　　　　　　　　　　　　　　　　　　　　　　　　　　　　　　　　　会場借用費、コピー用紙代　　　　　　　　　　　　　　　　　　　　　　分会大会後　懇親会　　　　　　　　　　　　　　　　　　　　　　　　　　　　　　　　　　　　　　　　　　　　　　懇親会飲食代"},{"$f":"IFERROR(VLOOKUP(M11,年度の予定・記録!$H:$AN,31,FALSE),\"\")","v":""},{"$nulls":5},{"$f":"IFERROR(VLOOKUP(S11,年度の予定・記録!$H:$AN,31,FALSE),\"\")","v":""},{"$nulls":5},{"$f":"IFERROR(VLOOKUP(Y11,年度の予定・記録!$H:$AN,31,FALSE),\"\")","v":""},{"$nulls":5},{"$f":"IFERROR(VLOOKUP(AE11,年度の予定・記録!$H:$AN,31,FALSE),\"\")","v":""},{"$nulls":6},{"$f":"IFERROR(VLOOKUP(AL11,年度の予定・記録!$H:$AN,31,FALSE),\"\")","v":""},{"$nulls":5},{"$f":"IFERROR(VLOOKUP(AR11,年度の予定・記録!$H:$AN,31,FALSE),\"\")","v":""},{"$nulls":5},{"$f":"IFERROR(VLOOKUP(AX11,年度の予定・記録!$H:$AN,31,FALSE),\"\")","v":"第2回分会執行委員会　　　　　　　　　　　　　　　　　　　　　　　　　　　　　　　　　　　　　　　　　　　　　　飲み物代（E：業務都合で欠席）"},{"$nulls":5},{"$f":"IFERROR(VLOOKUP(BD11,年度の予定・記録!$H:$AN,31,FALSE),\"\")","v":""},{"$nulls":5},{"$f":"IFERROR(VLOOKUP(BJ11,年度の予定・記録!$H:$AN,31,FALSE),\"\")","v":""},{"$nulls":5},{"$f":"IFERROR(VLOOKUP(BP11,年度の予定・記録!$H:$AN,31,FALSE),\"\")","v":"組織活動費　申請　　　　　　　　　　　　　　　　　　　　　　　　　　　　　　　　　　　　　　　　　　　　　　分会集会・執行委員会時　飲食費用として"},{"$nulls":5},{"$f":"IFERROR(VLOOKUP(BV11,年度の予定・記録!$H:$AN,31,FALSE),\"\")","v":""}]
[{"$nulls":7},{"$f":"AE11+1","v":"2021-09-19"},null,{"$f":"H13+1","v":"2021-09-20"},null,{"$f":"J13+1","v":"2021-09-21"},{"$f":"L13+1","v":"2021-09-22"},{"$nulls":5},{"$f":"M13+1","v":"2021-09-23"},{"$nulls":5},{"$f":"S13+1","v":"2021-09-24"},{"$nulls":5},{"$f":"Y13+1","v":"2021-09-25"},{"$nulls":6},{"$f":"BV11+1","v":"2021-10-17"},{"$nulls":5},{"$f":"AL13+1","v":"2021-10-18"},{"$nulls":5},{"$f":"AR13+1","v":"2021-10-19"},{"$nulls":5},{"$f":"AX13+1","v":"2021-10-20"},{"$nulls":5},{"$f":"BD13+1","v":"2021-10-21"},{"$nulls":5},{"$f":"BJ13+1","v":"2021-10-22"},{"$nulls":5},{"$f":"BP13+1","v":"2021-10-23"}]
[{"$nulls":7},{"$f":"IFERROR(VLOOKUP(H13,年度の予定・記録!$H:$AN,31,FALSE),\"\")","v":""},null,{"$f":"IFERROR(VLOOKUP(J13,年度の予定・記録!$H:$AN,31,FALSE),\"\")","v":""},null,{"$f":"IFERROR(VLOOKUP(L13,年度の予定・記録!$H:$AN,31,FALSE),\"\")","v":""},{"$f":"IFERROR(VLOOKUP(M13,年度の予定・記録!$H:$AN,31,FALSE),\"\")","v":"活動調査費支給　　　　　　　　　　　　　　　　　　　　　　　　　　　　　　　　　　　　　　　　　　　　　　6か月分（5名分）"},{"$nulls":5},{"$f":"IFERROR(VLOOKUP(S13,年度の予定・記録!$H:$AN,31,FALSE),\"\")","v":"現場パトロール　　　　　　　　　　　　　　　　　　　　　　　　　　　　　　　　　　　　　　　　　　　　　　差入れ飲み物代　　　　　　　　　　　　　　　　　　　　　　現場パトロール　　　　　　　　　　　　　　　　　　　　　　　　　　　　　　　　　　　　　　　　　　　　　　昼食代（3名分)"},{"$nulls":5},{"$f":"IFERROR(VLOOKUP(Y13,年度の予定・記録!$H:$AN,31,FALSE),\"\")","v":""},{"$nulls":5},{"$f":"IFERROR(VLOOKUP(AE13,年度の予定・記録!$H:$AN,31,FALSE),\"\")","v":""},{"$nulls":6},{"$f":"IFERROR(VLOOKUP(AL13,年度の予定・記録!$H:$AN,31,FALSE),\"\")","v":""},{"$nulls":5},{"$f":"IFERROR(VLOOKUP(AR13,年度の予定・記録!$H:$AN,31,FALSE),\"\")","v":""},{"$nulls":5},{"$f":"IFERROR(VLOOKUP(AX13,年度の予定・記録!$H:$AN,31,FALSE),\"\")","v":""},{"$nulls":5},{"$f":"IFERROR(VLOOKUP(BD13,年度の予定・記録!$H:$AN,31,FALSE),\"\")","v":"第1回分会集会　　　　　　　　　　　　　　　　　　　　　　　　　　　　　　　　　　　　　　　　　　　　　　飲み物代　　　　　　　　　　　　　　　　　　　　　　第1回分会集会　懇親会　　　　　　　　　　　　　　　　　　　　　　　　　　　　　　　　　　　　　　　　　　　　　　懇親会飲食代補助（会費不足分として）"},{"$nulls":5},{"$f":"IFERROR(VLOOKUP(BJ13,年度の予定・記録!$H:$AN,31,FALSE),\"\")","v":""},{"$nulls":5},{"$f":"IFERROR(VLOOKUP(BP13,年度の予定・記録!$H:$AN,31,FALSE),\"\")","v":""},{"$nulls":5},{"$f":"IFERROR(VLOOKUP(BV13,年度の予定・記録!$H:$AN,31,FALSE),\"\")","v":""}]
[{"$nulls":7},{"$f":"AE13+1","v":"2021-09-26"},null,{"$f":"H15+1","v":"2021-09-27"},null,{"$f":"J15+1","v":"2021-09-28"},{"$f":"L15+1","v":"2021-09-29"},{"$nulls":5},{"$f":"M15+1","v":"2021-09-30"},{"$nulls":5},{"$f":"S15+1","v":"2021-10-01"},{"$nulls":5},{"$f":"Y15+1","v":"2021-10-02"},{"$nulls":6},{"$f":"BV13+1","v":"2021-10-24"},{"$nulls":5},{"$f":"AL15+1","v":"2021-10-25"},{"$nulls":5},{"$f":"AR15+1","v":"2021-10-26"},{"$nulls":5},{"$f":"AX15+1","v":"2021-10-27"},{"$nulls":5},{"$f":"BD15+1","v":"2021-10-28"},{"$nulls":5},{"$f":"BJ15+1","v":"2021-10-29"},{"$nulls":5},{"$f":"BP15+1","v":"2021-10-30"}]
[{"$nulls":7},{"$f":"IFERROR(VLOOKUP(H15,年度の予定・記録!$H:$AN,31,FALSE),\"\")","v":""},null,{"$f":"IFERROR(VLOOKUP(J15,年度の予定・記録!$H:$AN,31,FALSE),\"\")","v":""},null,{"$f":"IFERROR(VLOOKUP(L15,年度の予定・記録!$H:$AN,31,FALSE),\"\")","v":""},{"$f":"IFERROR(VLOOKUP(M15,年度の予定・記録!$H:$AN,31,FALSE),\"\")","v":""},{"$nulls":5},{"$f":"IFERROR(VLOOKUP(S15,年度の予定・記録!$H:$AN,31,FALSE),\"\")","v":""},{"$nulls":5},{"$f":"IFERROR(VLOOKUP(Y15,年度の予定・記録!$H:$AN,31,FALSE),\"\")","v":""},{"$nulls":5},{"$f":"IFERROR(VLOOKUP(AE15,年度の予定・記録!$H:$AN,31,FALSE),\"\")","v":""},{"$nulls":6},{"$f":"IFERROR(VLOOKUP(AL15,年度の予定・記録!$H:$AN,31,FALSE),\"\")","v":""},{"$nulls":5},{"$f":"IFERROR(VLOOKUP(AR15,年度の予定・記録!$H:$AN,31,FALSE),\"\")","v":""},{"$nulls":5},{"$f":"IFERROR(VLOOKUP(AX15,年度の予定・記録!$H:$AN,31,FALSE),\"\")","v":""},{"$nulls":5},{"$f":"IFERROR(VLOOKUP(BD15,年度の予定・記録!$H:$AN,31,FALSE),\"\")","v":""},{"$nulls":5},{"$f":"IFERROR(VLOOKUP(BJ15,年度の予定・記録!$H:$AN,31,FALSE),\"\")","v":""},{"$nulls":5},{"$f":"IFERROR(VLOOKUP(BP15,年度の予定・記録!$H:$AN,31,FALSE),\"\")","v":""},{"$nulls":5},{"$f":"IFERROR(VLOOKUP(BV15,年度の予定・記録!$H:$AN,31,FALSE),\"\")","v":""}]
[{"$nulls":7},{"$f":"AE15+1","v":"2021-10-03"},null,{"$f":"H17+1","v":"2021-10-04"},null,{"$f":"J17+1","v":"2021-10-05"},{"$f":"L17+1","v":"2021-10-06"},{"$nulls":5},{"$f":"M17+1","v":"2021-10-07"},{"$nulls":5},{"$f":"S17+1","v":"2021-10-08"},{"$nulls":5},{"$f":"Y17+1","v":"2021-10-09"},{"$nulls":6},{"$f":"BV15+1","v":"2021-10-31"},{"$nulls":5},{"$f":"AL17+1","v":"2021-11-01"},{"$nulls":5},{"$f":"AR17+1","v":"2021-11-02"},{"$nulls":5},{"$f":"AX17+1","v":"2021-11-03"},{"$nulls":5},{"$f":"BD17+1","v":"2021-11-04"},{"$nulls":5},{"$f":"BJ17+1","v":"2021-11-05"},{"$nulls":5},{"$f":"BP17+1","v":"2021-11-06"}]
[{"$nulls":7},{"$f":"IFERROR(VLOOKUP(H17,年度の予定・記録!$H:$AN,31,FALSE),\"\")","v":""},null,{"$f":"IFERROR(VLOOKUP(J17,年度の予定・記録!$H:$AN,31,FALSE),\"\")","v":""},null,{"$f":"IFERROR(VLOOKUP(L17,年度の予定・記録!$H:$AN,31,FALSE),\"\")","v":""},{"$f":"IFERROR(VLOOKUP(M17,年度の予定・記録!$H:$AN,31,FALSE),\"\")","v":""},{"$nulls":5},{"$f":"IFERROR(VLOOKUP(S17,年度の予定・記録!$H:$AN,31,FALSE),\"\")","v":""},{"$nulls":5},{"$f":"IFERROR(VLOOKUP(Y17,年度の予定・記録!$H:$AN,31,FALSE),\"\")","v":""},{"$nulls":5},{"$f":"IFERROR(VLOOKUP(AE17,年度の予定・記録!$H:$AN,31,FALSE),\"\")","v":""},{"$nulls":6},{"$f":"IFERROR(VLOOKUP(AL17,年度の予定・記録!$H:$AN,31,FALSE),\"\")","v":""},{"$nulls":5},{"$f":"IFERROR(VLOOKUP(AR17,年度の予定・記録!$H:$AN,31,FALSE),\"\")","v":""},{"$nulls":5},{"$f":"IFERROR(VLOOKUP(AX17,年度の予定・記録!$H:$AN,31,FALSE),\"\")","v":""},{"$nulls":5},{"$f":"IFERROR(VLOOKUP(BD17,年度の予定・記録!$H:$AN,31,FALSE),\"\")","v":""},{"$nulls":5},{"$f":"IFERROR(VLOOKUP(BJ17,年度の予定・記録!$H:$AN,31,FALSE),\"\")","v":""},{"$nulls":5},{"$f":"IFERROR(VLOOKUP(BP17,年度の予定・記録!$H:$AN,31,FALSE),\"\")","v":""},{"$nulls":5},{"$f":"IFERROR(VLOOKUP(BV17,年度の予定・記録!$H:$AN,31,FALSE),\"\")","v":""}]
[]
[{"$nulls":3},{"$f":"TEXT(R21,\"yyyymm\")","v":"202109"},{"$nulls":3},"予定内容",{"$nulls":3},"対応者",{"$nulls":5},{"$f":"J5","v":9},{"$nulls":30},{"$f":"AR5","v":10}]
[{"$nulls":3},{"$f":"TEXT(AW21,\"yyyymm\")","v":"202110"},{"$nulls":13},{"$f":"L5","v":"2021-09-01"},{"$f":"R21+1","v":"2021-09-02"},{"$f":"S21+1","v":"2021-09-03"},"2021-09-04","2021-09-05","2021-09-06","2021-09-07","2021-09-08","2021-09-09","2021-09-10","2021-09-11","2021-09-12","2021-09-13","2021-09-14","2021-09-15","2021-09-16","2021-09-17","2021-09-18","2021-09-19","2021-09-20","2021-09-21","2021-09-22","2021-09-23","2021-09-24","2021-09-25","2021-09-26","2021-09-27","2021-09-28","2021-09-29","2021-09-30","2021-10-01",{"$f":"AX5","v":"2021-10-01"},{"$f":"AW21+1","v":"2021-10-02"},"2021-10-03","2021-10-04","2021-10-05","2021-10-06","2021-10-07","2021-10-08","2021-10-09","2021-10-10","2021-10-11","2021-10-12","2021-10-13","2021-10-14","2021-10-15","2021-10-16","2021-10-17","2021-10-18","2021-10-19","2021-10-20","2021-10-21","2021-10-22","2021-10-23","2021-10-24","2021-10-25","2021-10-26","2021-10-27","2021-10-28","2021-10-29","2021-10-30","2021-10-31"]
[{"$nulls":17},{"$f":"R21","v":44440},{"$f":"R22+1","v":44441},44442,44443,44444,44445,44446,44447,44448,44449,44450,44451,44452,44453,44454,44455,44456,44457,44458,44459,44460,44461,44462,44463,44464,44465,44466,44467,44468,44469,44470,{"$f":"AW21","v":44470},{"$f":"AW22+1","v":44471},{"$f":"AX22+1","v":44472},44473,44474,44475,44476,44477,44478,44479,44480,44481,44482,44483,44484,44485,44486,44487,44488,44489,44490,44491,44492,44493,44494,44495,44496,44497,44498,44499,44500]
[{"$nulls":3},{"$f":"VLOOKUP(1,年度の予定・記録!$D$9:$AJ$64,8,FALSE)","v":"分会交付金　振込日"},{"$f":"VLOOKUP(1,年度の予定・記録!$D$9:$AJ$64,31,FALSE)","v":"C"},{"$f":"VLOOKUP(1,年度の予定・記録!$D$9:$AJ$64,5,FALSE)","v":44449},{"$f":"VLOOKUP(1,年度の予定・記録!$D$9:$AJ$64,7,FALSE)","v":44449},{"$f":"IFERROR(D23,\"\")","v":"分会交付金　振込日"},{"$nulls":3},{"$f":"IFERROR(E23,\"\")","v":"C"},{"$nulls":68},{"$f":"IFERROR(VLOOKUP(H23,年度の予定・記録!$H:$AN,4,FALSE),\"\")","v":""}]
[{"$nulls":3},{"$f":"VLOOKUP(2,年度の予定・記録!$D$9:$AJ$64,8,FALSE)","v":"第1回分会執行委員会"},{"$f":"VLOOKUP(2,年度の予定・記録!$D$9:$AJ$64,31,FALSE)","v":"A ・ B  ・C  ・D  ・E"},{"$f":"VLOOKUP(2,年度の予定・記録!$D$9:$AJ$64,5,FALSE)","v":44451},{"$f":"VLOOKUP(2,年度の予定・記録!$D$9:$AJ$64,7,FALSE)","v":44451},{"$f":"IFERROR(D24,\"\")","v":"第1回分会執行委員会"},{"$nulls":3},{"$f":"IFERROR(E24,\"\")","v":"A ・ B  ・C  ・D  ・E"},{"$nulls":68},{"$f":"IFERROR(VLOOKUP(H24,年度の予定・記録!$H:$AN,4,FALSE),\"\")","v":""}]
[{"$nulls":3},{"$f":"VLOOKUP(3,年度の予定・記録!$D$9:$AJ$64,8,FALSE)","v":"分会大会"},{"$f":"VLOOKUP(3,年度の予定・記録!$D$9:$AJ$64,31,FALSE)","v":"全員"},{"$f":"VLOOKUP(3,年度の予定・記録!$D$9:$AJ$64,5,FALSE)","v":44453},{"$f":"VLOOKUP(3,年度の予定・記録!$D$9:$AJ$64,7,FALSE)","v":44453},"分会大会",{"$nulls":3},"全員",{"$nulls":68},{"$f":"IFERROR(VLOOKUP(H25,年度の予定・記録!$H:$AN,4,FALSE),\"\")","v":""}]
[{"$nulls":3},{"$f":"VLOOKUP(4,年度の予定・記録!$D$9:$AJ$64,8,FALSE)","v":"分会大会後　懇親会"},{"$f":"VLOOKUP(4,年度の予定・記録!$D$9:$AJ$64,31,FALSE)","v":"全員"},{"$f":"VLOOKUP(4,年度の予定・記録!$D$9:$AJ$64,5,FALSE)","v":44453},{"$f":"VLOOKUP(4,年度の予定・記録!$D$9:$AJ$64,7,FALSE)","v":44453},"分会大会後　懇親会",{"$nulls":3},"全員",{"$nulls":68},{"$f":"IFERROR(VLOOKUP(H26,年度の予定・記録!$H:$AN,4,FALSE),\"\")","v":""}]
[{"$nulls":3},{"$f":"VLOOKUP(5,年度の予定・記録!$D$9:$AJ$64,8,FALSE)","v":"活動調査費支給"},{"$f":"VLOOKUP(5,年度の予定・記録!$D$9:$AJ$64,31,FALSE)","v":"執行委員"},{"$f":"VLOOKUP(5,年度の予定・記録!$D$9:$AJ$64,5,FALSE)","v":44461},{"$f":"VLOOKUP(5,年度の予定・記録!$D$9:$AJ$64,7,FALSE)","v":44461},"活動調査費支給",{"$nulls":3},"執行委員",{"$nulls":68},{"$f":"IFERROR(VLOOKUP(H27,年度の予定・記録!$H:$AN,4,FALSE),\"\")","v":""}]
[{"$nulls":3},{"$f":"VLOOKUP(6,年度の予定・記録!$D$9:$AJ$63,8,FALSE)","v":"現場パトロール"},{"$f":"VLOOKUP(6,年度の予定・記録!$D$9:$AJ$64,31,FALSE)","v":"A ・ B  ・D"},{"$f":"VLOOKUP(6,年度の予定・記録!$D$9:$AJ$64,5,FALSE)","v":44462},{"$f":"VLOOKUP(6,年度の予定・記録!$D$9:$AJ$64,7,FALSE)","v":44462},"現場パトロール",{"$nulls":3},"A ・ B  ・D",{"$nulls":68},{"$f":"IFERROR(VLOOKUP(H28,年度の予定・記録!$H:$AN,4,FALSE),\"\")","v":""}]
[{"$nulls":3},{"$f":"VLOOKUP(7,年度の予定・記録!$D$9:$AJ$64,8,FALSE)","v":"現場パトロール"},{"$f":"VLOOKUP(7,年度の予定・記録!$D$9:$AJ$64,31,FALSE)","v":"A ・ B  ・D"},{"$f":"VLOOKUP(7,年度の予定・記録!$D$9:$AJ$64,5,FALSE)","v":44462},{"$f":"VLOOKUP(7,年度の予定・記録!$D$9:$AJ$64,7,FALSE)","v":44462},"現場パトロール",{"$nulls":3},"A ・ B  ・D",{"$nulls":68},{"$f":"IFERROR(VLOOKUP(H29,年度の予定・記録!$H:$AN,4,FALSE),\"\")","v":""}]
[{"$nulls":3},{"$f":"VLOOKUP(8,年度の予定・記録!$D$9:$AJ$63,8,FALSE)","v":"安全衛生委員会"},{"$f":"VLOOKUP(8,年度の予定・記録!$D$9:$AJ$64,31,FALSE)","v":"執行委員"},{"$f":"VLOOKUP(8,年度の予定・記録!$D$9:$AJ$64,5,FALSE)","v":44462},{"$f":"VLOOKUP(8,年度の予定・記録!$D$9:$AJ$64,7,FALSE)","v":44462},"安全衛生委員会",{"$nulls":3},"執行委員",{"$nulls":68},{"$f":"IFERROR(VLOOKUP(H30,年度の予定・記録!$H:$AN,4,FALSE),\"\")","v":""}]
[{"$nulls":3},{"$f":"VLOOKUP(9,年度の予定・記録!$D$9:$AJ$64,8,FALSE)","v":"第2回分会執行委員会"},{"$f":"VLOOKUP(9,年度の予定・記録!$D$9:$AJ$64,31,FALSE)","v":"A ・ B  ・C  ・D"},{"$f":"VLOOKUP(9,年度の予定・記録!$D$9:$AJ$64,5,FALSE)","v":44481},{"$f":"VLOOKUP(9,年度の予定・記録!$D$9:$AJ$64,7,FALSE)","v":44481},"第2回分会執行委員会",{"$nulls":3},"A ・ B  ・C  ・D",{"$nulls":68},{"$f":"IFERROR(VLOOKUP(H31,年度の予定・記録!$H:$AN,4,FALSE),\"\")","v":""}]
[{"$nulls":3},{"$f":"VLOOKUP(10,年度の予定・記録!$D$9:$AJ$64,8,FALSE)","v":"組織活動費　申請"},{"$f":"VLOOKUP(10,年度の予定・記録!$D$9:$AJ$64,31,FALSE)","v":"C"},{"$f":"VLOOKUP(10,年度の予定・記録!$D$9:$AJ$64,5,FALSE)","v":44484},{"$f":"VLOOKUP(10,年度の予定・記録!$D$9:$AJ$64,7,FALSE)","v":44484},"組織活動費　申請",{"$nulls":3},"C",{"$nulls":68},{"$f":"IFERROR(VLOOKUP(H32,年度の予定・記録!$H:$AN,4,FALSE),\"\")","v":""}]
[{"$nulls":3},{"$f":"VLOOKUP(11,年度の予定・記録!$D$9:$AJ$64,8,FALSE)","v":"第1回分会集会"},{"$f":"VLOOKUP(11,年度の予定・記録!$D$9:$AJ$64,31,FALSE)","v":"全員"},{"$f":"VLOOKUP(11,年度の予定・記録!$D$9:$AJ$64,5,FALSE)","v":44489},{"$f":"VLOOKUP(11,年度の予定・記録!$D$9:$AJ$64,7,FALSE)","v":44489},"第1回分会集会",{"$nulls":3},"全員",{"$nulls":68},{"$f":"IFERROR(VLOOKUP(H33,年度の予定・記録!$H:$AN,4,FALSE),\"\")","v":""}]
[{"$nulls":3},{"$f":"VLOOKUP(12,年度の予定・記録!$D$9:$AJ$64,8,FALSE)","v":"第1回分会集会　懇親会"},{"$f":"VLOOKUP(12,年度の予定・記録!$D$9:$AJ$64,31,FALSE)","v":"執行委員"},{"$f":"VLOOKUP(12,年度の予定・記録!$D$9:$AJ$64,5,FALSE)","v":44489},{"$f":"VLOOKUP(12,年度の予定・記録!$D$9:$AJ$64,7,FALSE)","v":44489},"第1回分会集会　懇親会",{"$nulls":3},"執行委員",{"$nulls":68},{"$f":"IFERROR(VLOOKUP(H34,年度の予定・記録!$H:$AN,4,FALSE),\"\")","v":""}]
[{"$nulls":3},{"$f":"VLOOKUP(13,年度の予定・記録!$D$9:$AJ$64,8,FALSE)","v":{"$error":"#N/A"}},{"$f":"VLOOKUP(13,年度の予定・記録!$D$9:$AJ$64,31,FALSE)","v":{"$error":"#N/A"}},{"$f":"VLOOKUP(13,年度の予定・記録!$D$9:$AJ$64,5,FALSE)","v":{"$error":"#N/A"}},{"$f":"VLOOKUP(13,年度の予定・記録!$D$9:$AJ$64,7,FALSE)","v":{"$error":"#N/A"}},"",{"$nulls":3},"",{"$nulls":68},{"$f":"IFERROR(VLOOKUP(H35,年度の予定・記録!$H:$AN,4,FALSE),\"\")","v":""}]
[{"$nulls":3},{"$f":"VLOOKUP(14,年度の予定・記録!$D$9:$AJ$64,8,FALSE)","v":{"$error":"#N/A"}},{"$f":"VLOOKUP(14,年度の予定・記録!$D$9:$AJ$64,31,FALSE)","v":{"$error":"#N/A"}},{"$f":"VLOOKUP(14,年度の予定・記録!$D$9:$AJ$64,5,FALSE)","v":{"$error":"#N/A"}},{"$f":"VLOOKUP(14,年度の予定・記録!$D$9:$AJ$64,7,FALSE)","v":{"$error":"#N/A"}},"",{"$nulls":3},"",{"$nulls":68},{"$f":"IFERROR(VLOOKUP(H36,年度の予定・記録!$H:$AN,4,FALSE),\"\")","v":""}]
[{"$nulls":3},{"$f":"VLOOKUP(15,年度の予定・記録!$D$9:$AJ$64,8,FALSE)","v":{"$error":"#N/A"}},{"$f":"VLOOKUP(15,年度の予定・記録!$D$9:$AJ$64,31,FALSE)","v":{"$error":"#N/A"}},{"$f":"VLOOKUP(15,年度の予定・記録!$D$9:$AJ$64,5,FALSE)","v":{"$error":"#N/A"}},{"$f":"VLOOKUP(15,年度の予定・記録!$D$9:$AJ$64,7,FALSE)","v":{"$error":"#N/A"}},"",{"$nulls":3},"",{"$nulls":68},{"$f":"IFERROR(VLOOKUP(H37,年度の予定・記録!$H:$AN,4,FALSE),\"\")","v":""}]
[{"$nulls":3},{"$f":"VLOOKUP(16,年度の予定・記録!$D$9:$AJ$64,8,FALSE)","v":{"$error":"#N/A"}},{"$f":"VLOOKUP(16,年度の予定・記録!$D$9:$AJ$64,31,FALSE)","v":{"$error":"#N/A"}},{"$f":"VLOOKUP(16,年度の予定・記録!$D$9:$AJ$64,5,FALSE)","v":{"$error":"#N/A"}},{"$f":"VLOOKUP(16,年度の予定・記録!$D$9:$AJ$64,7,FALSE)","v":{"$error":"#N/A"}},"",{"$nulls":3},"",{"$nulls":68},{"$f":"IFERROR(VLOOKUP(H38,年度の予定・記録!$H:$AN,4,FALSE),\"\")","v":""}]
[{"$nulls":3},{"$f":"VLOOKUP(17,年度の予定・記録!$D$9:$AJ$64,8,FALSE)","v":{"$error":"#N/A"}},{"$f":"VLOOKUP(17,年度の予定・記録!$D$9:$AJ$64,31,FALSE)","v":{"$error":"#N/A"}},{"$f":"VLOOKUP(17,年度の予定・記録!$D$9:$AJ$64,5,FALSE)","v":{"$error":"#N/A"}},{"$f":"VLOOKUP(17,年度の予定・記録!$D$9:$AJ$64,7,FALSE)","v":{"$error":"#N/A"}},"",{"$nulls":3},"",{"$nulls":68},{"$f":"IFERROR(VLOOKUP(H39,年度の予定・記録!$H:$AN,4,FALSE),\"\")","v":""}]
[{"$nulls":3},{"$f":"VLOOKUP(18,年度の予定・記録!$D$9:$AJ$64,8,FALSE)","v":{"$error":"#N/A"}},{"$f":"VLOOKUP(18,年度の予定・記録!$D$9:$AJ$64,31,FALSE)","v":{"$error":"#N/A"}},{"$f":"VLOOKUP(18,年度の予定・記録!$D$9:$AJ$64,5,FALSE)","v":{"$error":"#N/A"}},{"$f":"VLOOKUP(18,年度の予定・記録!$D$9:$AJ$64,7,FALSE)","v":{"$error":"#N/A"}},"",{"$nulls":3},"",{"$nulls":68},{"$f":"IFERROR(VLOOKUP(H40,年度の予定・記録!$H:$AN,4,FALSE),\"\")","v":""}]
[{"$nulls":3},{"$f":"VLOOKUP(19,年度の予定・記録!$D$9:$AJ$64,8,FALSE)","v":{"$error":"#N/A"}},{"$f":"VLOOKUP(19,年度の予定・記録!$D$9:$AJ$64,31,FALSE)","v":{"$error":"#N/A"}},{"$f":"VLOOKUP(19,年度の予定・記録!$D$9:$AJ$64,5,FALSE)","v":{"$error":"#N/A"}},{"$f":"VLOOKUP(19,年度の予定・記録!$D$9:$AJ$64,7,FALSE)","v":{"$error":"#N/A"}},"",{"$nulls":3},"",{"$nulls":68},{"$f":"IFERROR(VLOOKUP(H41,年度の予定・記録!$H:$AN,4,FALSE),\"\")","v":""}]
[{"$nulls":3},{"$f":"VLOOKUP(20,年度の予定・記録!$D$9:$AJ$64,8,FALSE)","v":{"$error":"#N/A"}},{"$f":"VLOOKUP(20,年度の予定・記録!$D$9:$AJ$64,31,FALSE)","v":{"$error":"#N/A"}},{"$f":"VLOOKUP(20,年度の予定・記録!$D$9:$AJ$64,5,FALSE)","v":{"$error":"#N/A"}},{"$f":"VLOOKUP(20,年度の予定・記録!$D$9:$AJ$64,7,FALSE)","v":{"$error":"#N/A"}},"",{"$nulls":3},"",{"$nulls":68},{"$f":"IFERROR(VLOOKUP(H42,年度の予定・記録!$H:$AN,4,FALSE),\"\")","v":""}]
[{"$nulls":3},{"$f":"VLOOKUP(21,年度の予定・記録!$D$9:$AJ$64,8,FALSE)","v":{"$error":"#N/A"}},{"$f":"VLOOKUP(21,年度の予定・記録!$D$9:$AJ$64,31,FALSE)","v":{"$error":"#N/A"}},{"$f":"VLOOKUP(21,年度の予定・記録!$D$9:$AJ$64,5,FALSE)","v":{"$error":"#N/A"}},{"$f":"VLOOKUP(21,年度の予定・記録!$D$9:$AJ$64,7,FALSE)","v":{"$error":"#N/A"}},"",{"$nulls":3},"",{"$nulls":68},{"$f":"IFERROR(VLOOKUP(H43,年度の予定・記録!$H:$AN,4,FALSE),\"\")","v":""}]
[{"$nulls":3},{"$f":"VLOOKUP(22,年度の予定・記録!$D$9:$AJ$64,8,FALSE)","v":{"$error":"#N/A"}},{"$f":"VLOOKUP(22,年度の予定・記録!$D$9:$AJ$64,31,FALSE)","v":{"$error":"#N/A"}},{"$f":"VLOOKUP(22,年度の予定・記録!$D$9:$AJ$64,5,FALSE)","v":{"$error":"#N/A"}},{"$f":"VLOOKUP(22,年度の予定・記録!$D$9:$AJ$64,7,FALSE)","v":{"$error":"#N/A"}},"",{"$nulls":3},"",{"$nulls":68},{"$f":"IFERROR(VLOOKUP(H44,年度の予定・記録!$H:$AN,4,FALSE),\"\")","v":""}]
[{"$nulls":3},{"$f":"VLOOKUP(23,年度の予定・記録!$D$9:$AJ$64,8,FALSE)","v":{"$error":"#N/A"}},{"$f":"VLOOKUP(23,年度の予定・記録!$D$9:$AJ$64,31,FALSE)","v":{"$error":"#N/A"}},{"$f":"VLOOKUP(23,年度の予定・記録!$D$9:$AJ$64,5,FALSE)","v":{"$error":"#N/A"}},{"$f":"VLOOKUP(23,年度の予定・記録!$D$9:$AJ$64,7,FALSE)","v":{"$error":"#N/A"}},"",{"$nulls":3},"",{"$nulls":68},{"$f":"IFERROR(VLOOKUP(H45,年度の予定・記録!$H:$AN,4,FALSE),\"\")","v":""}]
[{"$nulls":3},{"$f":"VLOOKUP(24,年度の予定・記録!$D$9:$AJ$64,8,FALSE)","v":{"$error":"#N/A"}},{"$f":"VLOOKUP(24,年度の予定・記録!$D$9:$AJ$64,31,FALSE)","v":{"$error":"#N/A"}},{"$f":"VLOOKUP(24,年度の予定・記録!$D$9:$AJ$64,5,FALSE)","v":{"$error":"#N/A"}},{"$f":"VLOOKUP(24,年度の予定・記録!$D$9:$AJ$64,7,FALSE)","v":{"$error":"#N/A"}},"",{"$nulls":3},"",{"$nulls":68},{"$f":"IFERROR(VLOOKUP(H46,年度の予定・記録!$H:$AN,4,FALSE),\"\")","v":""}]
[{"$nulls":3},{"$f":"VLOOKUP(25,年度の予定・記録!$D$9:$AJ$64,8,FALSE)","v":{"$error":"#N/A"}},{"$f":"VLOOKUP(25,年度の予定・記録!$D$9:$AJ$64,31,FALSE)","v":{"$error":"#N/A"}},{"$f":"VLOOKUP(25,年度の予定・記録!$D$9:$AJ$64,5,FALSE)","v":{"$error":"#N/A"}},{"$f":"VLOOKUP(25,年度の予定・記録!$D$9:$AJ$64,7,FALSE)","v":{"$error":"#N/A"}},"",{"$nulls":3},"",{"$nulls":68},{"$f":"IFERROR(VLOOKUP(H47,年度の予定・記録!$H:$AN,4,FALSE),\"\")","v":""}]
[{"$nulls":3},{"$f":"VLOOKUP(26,年度の予定・記録!$D$9:$AJ$64,8,FALSE)","v":{"$error":"#N/A"}},{"$f":"VLOOKUP(26,年度の予定・記録!$D$9:$AJ$64,31,FALSE)","v":{"$error":"#N/A"}},{"$f":"VLOOKUP(26,年度の予定・記録!$D$9:$AJ$64,5,FALSE)","v":{"$error":"#N/A"}},{"$f":"VLOOKUP(26,年度の予定・記録!$D$9:$AJ$64,7,FALSE)","v":{"$error":"#N/A"}},"",{"$nulls":3},"",{"$nulls":68},{"$f":"IFERROR(VLOOKUP(H48,年度の予定・記録!$H:$AN,4,FALSE),\"\")","v":""}]
[{"$nulls":3},{"$f":"VLOOKUP(27,年度の予定・記録!$D$9:$AJ$64,8,FALSE)","v":{"$error":"#N/A"}},{"$f":"VLOOKUP(27,年度の予定・記録!$D$9:$AJ$64,31,FALSE)","v":{"$error":"#N/A"}},{"$f":"VLOOKUP(27,年度の予定・記録!$D$9:$AJ$64,5,FALSE)","v":{"$error":"#N/A"}},{"$f":"VLOOKUP(27,年度の予定・記録!$D$9:$AJ$64,7,FALSE)","v":{"$error":"#N/A"}},"",{"$nulls":3},"",{"$nulls":68},{"$f":"IFERROR(VLOOKUP(H49,年度の予定・記録!$H:$AN,4,FALSE),\"\")","v":""}]
[{"$nulls":3},{"$f":"VLOOKUP(28,年度の予定・記録!$D$9:$AJ$64,8,FALSE)","v":{"$error":"#N/A"}},{"$f":"VLOOKUP(28,年度の予定・記録!$D$9:$AJ$64,31,FALSE)","v":{"$error":"#N/A"}},{"$f":"VLOOKUP(28,年度の予定・記録!$D$9:$AJ$64,5,FALSE)","v":{"$error":"#N/A"}},{"$f":"VLOOKUP(28,年度の予定・記録!$D$9:$AJ$64,7,FALSE)","v":{"$error":"#N/A"}},"",{"$nulls":3},"",{"$nulls":68},{"$f":"IFERROR(VLOOKUP(H50,年度の予定・記録!$H:$AN,4,FALSE),\"\")","v":""}]
[{"$nulls":3},{"$f":"VLOOKUP(29,年度の予定・記録!$D$9:$AJ$64,8,FALSE)","v":{"$error":"#N/A"}},{"$f":"VLOOKUP(29,年度の予定・記録!$D$9:$AJ$64,31,FALSE)","v":{"$error":"#N/A"}},{"$f":"VLOOKUP(29,年度の予定・記録!$D$9:$AJ$64,5,FALSE)","v":{"$error":"#N/A"}},{"$f":"VLOOKUP(29,年度の予定・記録!$D$9:$AJ$64,7,FALSE)","v":{"$error":"#N/A"}},"",{"$nulls":3},"",{"$nulls":68},{"$f":"IFERROR(VLOOKUP(H51,年度の予定・記録!$H:$AN,4,FALSE),\"\")","v":""}]
[{"$nulls":3},{"$f":"VLOOKUP(30,年度の予定・記録!$D$9:$AJ$64,8,FALSE)","v":{"$error":"#N/A"}},{"$f":"VLOOKUP(30,年度の予定・記録!$D$9:$AJ$64,31,FALSE)","v":{"$error":"#N/A"}},{"$f":"VLOOKUP(30,年度の予定・記録!$D$9:$AJ$64,5,FALSE)","v":{"$error":"#N/A"}},{"$f":"VLOOKUP(30,年度の予定・記録!$D$9:$AJ$64,7,FALSE)","v":{"$error":"#N/A"}},"",{"$nulls":3},"",{"$nulls":68},{"$f":"IFERROR(VLOOKUP(H52,年度の予定・記録!$H:$AN,4,FALSE),\"\")","v":""}]
[{"$nulls":3},{"$f":"VLOOKUP(31,年度の予定・記録!$D$9:$AJ$64,8,FALSE)","v":{"$error":"#N/A"}},{"$f":"VLOOKUP(31,年度の予定・記録!$D$9:$AJ$64,31,FALSE)","v":{"$error":"#N/A"}},{"$f":"VLOOKUP(31,年度の予定・記録!$D$9:$AJ$64,5,FALSE)","v":{"$error":"#N/A"}},{"$f":"VLOOKUP(31,年度の予定・記録!$D$9:$AJ$64,7,FALSE)","v":{"$error":"#N/A"}},"",{"$nulls":3},""]

{"sheet":"Sheet1","index":4,"n_rows":8,"n_cols":8,"rows_kept":8}
[]
[null,{"$f":"年度の予定・記録!AX1","v":"科目"},{"$f":"年度の予定・記録!AY1","v":"総務費"},{"$f":"年度の予定・記録!AZ1","v":"活動調査費"},{"$f":"年度の予定・記録!BA1","v":"組織活動費"},{"$f":"年度の予定・記録!BB1","v":"大会費"},{"$f":"年度の予定・記録!BC1","v":"予備費"},{"$f":"年度の予定・記録!BD1","v":"合計"}]
[null,"内訳例","・コピー用紙・文具・事務用品など　　　　　　　　　　　　　　　　　　　　　　　・電報・郵便・郵送代\n・弔電・香典等の慶弔対応費用　　　　　　　　　　　　　　　　　　　　　　　　　　　　　　　　　　　　　　　　　　　　　　　　　　　　　　　　　　　　　　　　　　　　　　　　　・その他り込み手数料等の事務費","・分会執行役員の活動調査費　　　　　　　　　　　　　　　　　　　　　　　　　　　　　　　　　　　　・活動に必要な新聞・書本・雑誌購入代金","【総務費】、【活動費】、【大会費】以外                           全ての活動経費　　　　　　　　　　","・分会大会の開催に掛かるすべての経費                      (会場借用費、飲食代等）\n・大会後の懇親会等については、組織活動費として計上すること。","・前年度繰越金、銀行利息等　　　　　　　　　　　　　　　　　　・各科目毎に予算を超えてしまった部分の充当　　　　　　　　　　　　　　　　　　　　　　　　　　"]
[null,{"$f":"年度の予定・記録!AX2","v":"予算"},{"$f":"年度の予定・記録!AY2","v":{"v":37400,"d":"¥37,400"}},{"$f":"年度の予定・記録!AZ2","v":{"v":135000,"d":"¥135,000"}},{"$f":"年度の予定・記録!BA2","v":{"v":198100,"d":"¥198,100"}},{"$f":"年度の予定・記録!BB2","v":{"v":16100,"d":"¥16,100"}},{"$f":"年度の予定・記録!BC2","v":{"v":13618,"d":"¥13,618"}},{"$f":"年度の予定・記録!BD2","v":{"v":400218,"d":"¥400,218"}}]
[null,{"$f":"年度の予定・記録!AX3","v":"支出額"},{"$f":"年度の予定・記録!AY3","v":{"v":0,"d":"¥0"}},{"$f":"年度の予定・記録!AZ3","v":{"v":120000,"d":"¥120,000"}},{"$f":"年度の予定・記録!BA3","v":{"v":146766,"d":"¥146,766"}},{"$f":"年度の予定・記録!BB3","v":{"v":12340,"d":"¥12,340"}},{"$f":"年度の予定・記録!BC3","v":{"v":0,"d":"¥0"}},{"$f":"年度の予定・記録!BD3","v":{"v":279106,"d":"¥279,106"}}]
[null,{"$f":"年度の予定・記録!AX5","v":"収入額"},{"$f":"年度の予定・記録!AY5","v":{"v":0,"d":"¥0"}},{"$f":"年度の予定・記録!AZ5","v":{"v":120000,"d":"¥120,000"}},{"$f":"年度の予定・記録!BA5","v":{"v":146766,"d":"¥146,766"}},{"$f":"年度の予定・記録!BB5","v":{"v":12340,"d":"¥12,340"}},{"$f":"年度の予定・記録!BC5","v":{"v":0,"d":"¥0"}},{"$f":"年度の予定・記録!BD5","v":{"v":279106,"d":"¥279,106"}}]
[null,{"$f":"年度の予定・記録!AX6","v":"予算超過分"},{"$f":"年度の予定・記録!AY6","v":{"v":0,"d":"¥0"}},{"$f":"年度の予定・記録!AZ6","v":{"v":0,"d":"¥0"}},{"$f":"年度の予定・記録!BA6","v":{"v":0,"d":"¥0"}},{"$f":"年度の予定・記録!BB6","v":{"v":0,"d":"¥0"}},{"$f":"年度の予定・記録!BC6","v":{"v":0,"d":"¥0"}},{"$f":"年度の予定・記録!BD6","v":{"v":0,"d":"¥0"}}]
[null,{"$f":"年度の予定・記録!AX7","v":"使用率"},{"$f":"年度の予定・記録!AY7","v":{"v":0,"d":"0.0%"}},{"$f":"年度の予定・記録!AZ7","v":{"v":0.8888888888888888,"d":"88.9%"}},{"$f":"年度の予定・記録!BA7","v":{"v":0.7408682483594144,"d":"74.1%"}},{"$f":"年度の予定・記録!BB7","v":{"v":0.7664596273291926,"d":"76.6%"}},{"$f":"年度の予定・記録!BC7","v":{"v":0,"d":"0.0%"}},{"$f":"年度の予定・記録!BD7","v":{"v":0.6973849252157575,"d":"69.7%"}}]

{"sheet":"分会定期大会開催案内書　兼　委任状","index":5,"n_rows":38,"n_cols":6,"rows_kept":38,"merged":[[2,1,2,9],[3,1,3,9],[4,1,4,9],[5,1,5,9],[7,1,8,9],[10,1,10,9],[11,1,11,9],[12,1,12,9],[13,1,13,9],[14,1,14,9],[15,1,15,9],[17,1,17,9],[19,1,19,3],[19,4,19,9],[20,1,20,3],[20,4,20,9],[21,1,21,3],[21,4,21,9],[24,1,25,9],[27,1,28,9],[30,1,31,9],[32,1,33,9],[35,5,36,8],[37,5,38,8]]}
[]
[]
[null,{"$f":"TODAY()","v":"2022-08-30"}]
[null,{"$f":"データリスト!F4&\"分会組合員　様\"","v":"福島分会組合員　様"}]
[null,{"$f":"\"ユアテックユニオン\"&データリスト!F4&\"分会\"","v":"ユアテックユニオン福島分会"}]
[null,{"$f":"\"執行委員長     \"&データリスト!F13","v":"執行委員長     A"}]
[]
[null,{"$f":"\"第\"&データリスト!I6&\"回\"&データリスト!F4&\"分会\"&データリスト!F21&\"大会の開催について（出席要請）\"","v":"第59回福島分会定期大会の開催について（出席要請）"}]
[]
[]
[null,"　日頃よりユニオン諸活動に対しまして特段のご理解、ご協力頂き深く感謝申し上げます。"]
[null,{"$f":"\"　さて、\"&\"第\"&データリスト!I6&\"回\"&データリスト!F4&\"分会\"&データリスト!F21&\"大会を下記のとおり開催いたします。つきましては、大変お忙しい\"","v":"　さて、第59回福島分会定期大会を下記のとおり開催いたします。つきましては、大変お忙しい"}]
[null,"ところ恐れ入りますが、分会大会開催にあたりまして職場組合員皆様のご出席頂けます様、お願"]
[null,"い申し上げます。"]
[null,"　なお、大会当日、業務都合等により出席できない場合は、下記の委任状に必要事項を記入捺印"]
[null,"のうえ、開催日の朝までに分会役員へ提出してください。"]
[]
[null,"記"]
[]
[null,"　（１）開催日時",null,null,{"$f":"データリスト!F19","v":"2022-09-06T18:30:00"}]
[null,"　（２）開催場所",null,null,{"$f":"データリスト!I19","v":"別館会議室２F"}]
[null,"　（３）上程議案",null,null,"別紙議案書のとおり"]
[]
[]
[null,"委任状"]
[]
[]
[null,{"$f":"\"　　　第\"&データリスト!I6&\"回\"&データリスト!F4&\"分会\"&データリスト!F21&\"大会議長　殿\"","v":"　　　第59回福島分会定期大会議長　殿"}]
[]
[]
[null,{"$f":"\"　私は、\"&TEXT(データリスト!F19,\"GGGE年M月D日\")&\"に開催される「第\"&データリスト!I6&\"回\"&データリスト!F4&\"分会\"&データリスト!F21&\"大会」における議事およ\"","v":"　私は、令和4年9月6日に開催される「第59回福島分会定期大会」における議事およ"}]
[]
[null,"びその他一切の事項に関する議決権を大会議長に委任致します。"]
[]
[]
[{"$nulls":5},{"$f":"\"ユアテックユニオン\"&データリスト!F4&\"分会\"","v":"ユアテックユニオン福島分会"}]
[]
[{"$nulls":5},"氏名　　　　　　　　　　　　㊞"]

{"sheet":"分会大会議案書","index":6,"n_rows":86,"n_cols":58,"rows_kept":86,"merged":[[3,11,4,17],[3,21,5,34],[3,38,5,46],[3,50,5,56],[4,1,9,8],[6,20,10,35],[6,42,6,45],[7,38,8,39],[7,42,8,46],[8,49,22,57],[9,38,10,39],[9,42,10,46],[11,19,11,21],[11,22,11,27],[11,28,11,30],[11,31,11,36],[11,37,12,42],[11,43,12,48],[12,19,12,21],[12,22,12,27],[12,28,12,30],[12,31,12,36],[13,19,13,21],[13,22,13,27],[13,28,13,30],[13,31,13,36],[13,37,14,38],[13,39,14,40],[13,41,14,42],[13,43,14,44],[13,45,14,46],[13,47,14,48],[14,19,14,21],[14,22,14,27],[14,28,14,30],[14,31,14,36],[15,2,20,7],[15,19,15,21],[15,22,15,27],[15,28,15,30],[15,31,15,36],[15,37,16,38],[15,39,16,40],[15,41,16,42],[15,43,16,44],[15,45,16,46],[15,47,16,48],[16,19,16,21],[16,22,16,27],[16,28,16,30],[16,31,16,36],[17,19,17,21],[17,22,17,27],[17,28,17,30],[17,31,17,36],[17,37,18,38],[17,39,18,40],[17,41,18,42],[17,43,18,44],[17,45,18,46],[17,47,18,48],[18,19,18,21],[18,22,18,27],[18,28,18,30],[18,31,18,36],[19,19,19,21],[19,22,19,27],[19,28,19,30],[19,31,19,36],[19,37,20,38],[19,39,20,40],[19,41,20,42],[19,43,20,44],[19,45,20,46],[19,47,20,48],[20,19,20,21],[20,22,20,27],[20,28,20,30],[20,31,20,36],[21,19,21,21],[21,22,21,27],[21,28,21,30],[21,31,21,36],[21,37,22,38],[21,39,22,40],[21,41,22,42],[21,43,22,44],[21,45,22,46],[21,47,22,48],[22,19,22,21],[22,22,22,27],[22,28,22,30],[22,31,22,36],[23,19,23,21],[23,22,23,27],[23,28,23,30],[23,31,23,36],[23,37,24,38],[23,39,24,40],[23,41,24,42],[23,43,24,44],[23,45,24,46],[23,47,24,48],[24,19,24,21],[24,22,24,27],[24,28,24,30],[24,31,24,36],[25,19,25,21],[25,22,25,27],[25,28,25,30],[25,31,25,36],[25,37,26,38],[25,39,26,40],[25,41,26,42],[25,43,26,44],[25,45,26,46],[25,47,26,48],[26,19,26,21],[26,22,26,27],[26,28,26,30],[26,31,26,36],[27,19,27,21],[27,22,27,27],[27,28,27,30],[27,31,27,36],[27,37,28,38],[27,39,28,40],[27,41,28,42],[27,43,28,44],[27,45,28,46],[27,47,28,48],[28,19,28,21],[28,22,28,27],[28,28,28,30],[28,31,28,36],[29,19,29,21],[29,22,29,27],[29,28,29,30],[29,31,29,36],[29,37,30,38],[29,39,30,40],[29,41,30,42],[29,43,30,44],[29,45,30,46],[29,47,30,48],[29,52,30,57],[30,19,30,21],[30,22,30,27],[30,28,30,30],[30,31,30,36],[31,19,31,21],[31,22,31,27],[31,28,31,30],[31,31,31,36],[31,37,32,38],[31,39,32,40],[31,41,32,42],[31,43,32,44],[31,45,32,46],[31,47,32,48],[32,19,32,21],[32,22,32,27],[32,28,32,30],[32,31,32,36],[32,49,33,57],[33,2,34,9],[33,19,33,21],[33,22,33,27],[33,28,33,30],[33,31,33,36],[34,19,34,21],[34,22,34,27],[34,28,34,30],[34,31,34,36],[34,37,34,48],[34,49,35,57],[35,0,36,9],[35,19,35,21],[35,22,35,27],[35,28,35,30],[35,31,35,36],[36,19,36,21],[36,22,36,27],[36,28,36,30],[36,31,36,36],[36,37,36,48],[37,4,38,7],[37,19,37,21],[37,22,37,27],[37,28,37,30],[37,31,37,36],[37,37,37,48],[37,52,38,57],[38,19,38,21],[38,22,38,27],[38,28,38,30],[38,31,38,36],[39,0,40,9],[39,19,39,21],[39,22,39,27],[39,28,39,30],[39,31,39,36],[39,37,39,48],[39,52,40,56],[39,57,40,57],[40,19,40,21],[40,22,40,27],[40,28,40,30],[40,31,40,36],[41,19,41,21],[41,22,41,27],[41,28,41,30],[41,31,41,36],[42,19,42,21],[42,22,42,27],[42,28,42,30],[42,31,42,36],[43,37,44,48],[44,0,45,9],[44,19,45,36],[45,37,47,48],[46,1,48,8],[46,11,48,17],[46,21,48,34],[46,50,48,56],[49,1,50,8],[49,20,50,28],[49,29,50,33],[49,34,50,35],[49,37,50,41],[49,42,50,44],[49,45,50,48],[50,11,51,17],[51,20,52,35],[51,37,52,41],[51,42,52,44],[51,45,52,48],[51,50,52,56],[52,0,68,9],[52,11,55,17],[53,37,54,41],[53,42,54,44],[53,45,54,48],[54,19,55,36],[55,37,56,41],[55,42,56,44],[55,45,56,48],[55,50,56,56],[56,11,57,17],[56,21,58,34],[57,37,58,41],[57,42,58,44],[57,45,58,48],[58,11,61,17],[59,37,60,41],[59,42,60,44],[59,45,60,48],[59,50,60,56],[60,19,63,27],[60,28,63,36],[62,11,63,17],[63,50,64,56],[64,11,67,17],[64,19,66,22],[64,23,66,27],[64,28,66,31],[64,32,66,36],[64,37,66,48],[67,19,69,22],[67,23,69,27],[67,28,69,31],[67,32,69,36],[67,50,68,56],[68,11,69,17],[68,37,69,41],[68,42,69,44],[68,45,69,48],[70,0,72,9],[70,11,73,17],[70,19,72,22],[70,23,72,27],[70,28,72,31],[70,32,72,36],[70,37,71,41],[70,42,71,44],[70,45,71,48],[72,37,73,41],[72,42,73,44],[72,45,73,48],[73,19,75,22],[73,23,75,27],[73,28,75,31],[73,32,75,36],[74,0,76,9],[74,11,75,17],[74,37,75,41],[74,42,75,44],[74,45,75,48],[76,11,79,17],[76,19,78,22],[76,23,78,27],[76,28,78,31],[76,32,78,36],[76,37,77,41],[76,42,77,44],[76,45,77,48],[78,0,80,9],[78,37,79,41],[78,42,79,44],[78,45,79,48],[79,19,81,22],[79,23,81,27],[79,28,81,31],[79,32,81,36],[80,11,81,17],[82,0,84,9],[82,11,85,17],[82,19,84,22],[82,23,84,27],[82,28,84,31],[82,32,84,36],[84,37,84,48],[85,23,85,27]]}
[]
[]
[]
[{"$nulls":11},"分会大会議事",{"$nulls":9},{"$f":"データリスト!F68&\"年度 活動経過報告\"","v":"2021年度 活動経過報告"},{"$nulls":16},{"$f":"データリスト!F68&\"年度 会計報告\"","v":"2021年度 会計報告"},{"$nulls":11},{"$f":"データリスト!F68&\"年度会計監査報告\"","v":"2021年度会計監査報告"}]
[null,{"$f":"\"第\"&データリスト!I6&\"回\"&\"　\"&データリスト!F4&\"分会\"&\"　\"&データリスト!F21&\"大会\"","v":"第59回　福島分会　定期大会"}]
[{"$nulls":11},"１．","司会者挨拶"]
[{"$nulls":20},{"$f":"\"　私達は、\"&データリスト!F68&\"年度活動方針を踏まえ労働組合の目的である　　　　　　　　　　　　「福利厚生を含めた総合的労働条件の向上を図り組合員とその家族の幸せを確実に拡大していくこと」を深く認識し、心・力を合わせ活動してきました。\"","v":"　私達は、2021年度活動方針を踏まえ労働組合の目的である　　　　　　　　　　　　「福利厚生を含めた総合的労働条件の向上を図り組合員とその家族の幸せを確実に拡大していくこと」を深く認識し、心・力を合わせ活動してきました。"},{"$nulls":21},{"$f":"データリスト!J68","v":44409}]
[{"$nulls":11},"２．","資格審査",{"$nulls":25},"自",{"$nulls":3},{"$f":"TEXT(AQ7,\"ggge年\")&\"8月1日\"","v":"令和3年8月1日"}]
[{"$nulls":49},{"$f":"\"会計監査人は、\"&データリスト!F68&\"年度会計について本部分会交付金規定に基づき、\"&データリスト!Q33&\"の計\"&データリスト!K36&\"回に亘って厳正な監査を実施しました。監査の結果、出納簿・領収書・現金・預金等、確かに示されていることを認めます。\"","v":"会計監査人は、2021年度会計について本部分会交付金規定に基づき、の計0回に亘って厳正な監査を実施しました。監査の結果、出納簿・領収書・現金・預金等、確かに示されていることを認めます。"}]
[{"$nulls":11},"３．","大会成立宣言",{"$nulls":25},"至",{"$nulls":3},{"$f":"TEXT(AQ7+365,\"ggge年\")&\"7月31日\"","v":"令和4年7月31日"}]
[]
[{"$nulls":11},"４．","大会議長団選出",{"$nulls":6},{"$f":"IFERROR(VLOOKUP(1,年度の予定・記録!$B$10:$K$64,7,FALSE),\"\")","v":"2021-09-12"},null,null,{"$f":"IFERROR(VLOOKUP(1,年度の予定・記録!$B$10:$K$64,10,FALSE),\"\")","v":"第1回分会執行委員会"},{"$nulls":5},{"$f":"IFERROR(VLOOKUP(33,年度の予定・記録!$B$10:$K$64,7,FALSE),\"\")","v":""},null,null,{"$f":"IFERROR(VLOOKUP(33,年度の予定・記録!$B$10:$K$64,10,FALSE),\"\")","v":""},{"$nulls":5},"支出の部",{"$nulls":5},"収入の部"]
[{"$nulls":19},{"$f":"IFERROR(VLOOKUP(2,年度の予定・記録!$B$10:$K$64,7,FALSE),\"\")","v":"2021-09-14"},null,null,{"$f":"IFERROR(VLOOKUP(2,年度の予定・記録!$B$10:$K$64,10,FALSE),\"\")","v":"分会大会"},{"$nulls":5},{"$f":"IFERROR(VLOOKUP(34,年度の予定・記録!$B$10:$K$64,7,FALSE),\"\")","v":""},null,null,{"$f":"IFERROR(VLOOKUP(34,年度の予定・記録!$B$10:$K$64,10,FALSE),\"\")","v":""}]
[{"$nulls":11},"５．","議長団挨拶",{"$nulls":6},{"$f":"IFERROR(VLOOKUP(3,年度の予定・記録!$B$10:$K$64,7,FALSE),\"\")","v":"2021-09-23"},null,null,{"$f":"IFERROR(VLOOKUP(3,年度の予定・記録!$B$10:$K$64,10,FALSE),\"\")","v":"現場パトロール"},{"$nulls":5},{"$f":"IFERROR(VLOOKUP(35,年度の予定・記録!$B$10:$K$64,7,FALSE),\"\")","v":""},null,null,{"$f":"IFERROR(VLOOKUP(35,年度の予定・記録!$B$10:$K$64,10,FALSE),\"\")","v":""},{"$nulls":5},"科目",null,"予算額",null,"実績",null,"科目",null,"予算額",null,"実績"]
[{"$nulls":19},{"$f":"IFERROR(VLOOKUP(4,年度の予定・記録!$B$10:$K$64,7,FALSE),\"\")","v":"2021-09-23"},null,null,{"$f":"IFERROR(VLOOKUP(4,年度の予定・記録!$B$10:$K$64,10,FALSE),\"\")","v":"現場パトロール"},{"$nulls":5},{"$f":"IFERROR(VLOOKUP(36,年度の予定・記録!$B$10:$K$64,7,FALSE),\"\")","v":""},null,null,{"$f":"IFERROR(VLOOKUP(36,年度の予定・記録!$B$10:$K$64,10,FALSE),\"\")","v":""}]
[null,null,"議　案　書",{"$nulls":8},"6.　","大会書記任命",{"$nulls":6},{"$f":"IFERROR(VLOOKUP(5,年度の予定・記録!$B$10:$K$64,7,FALSE),\"\")","v":"2021-09-23"},null,null,{"$f":"IFERROR(VLOOKUP(5,年度の予定・記録!$B$10:$K$64,10,FALSE),\"\")","v":"安全衛生委員会"},{"$nulls":5},{"$f":"IFERROR(VLOOKUP(37,年度の予定・記録!$B$10:$K$64,7,FALSE),\"\")","v":""},null,null,{"$f":"IFERROR(VLOOKUP(37,年度の予定・記録!$B$10:$K$64,10,FALSE),\"\")","v":""},{"$nulls":5},"総務費",null,{"$f":"データリスト!F33","v":{"v":37400,"d":"¥37,400"}},null,{"$f":"SUMIF(年度の予定・記録!W10:Y64,AL16,年度の予定・記録!Y10:Y64)","v":0},null,"分会交付金",null,{"$f":"データリスト!F26","v":{"v":386600,"d":"¥386,600"}},null,{"$f":"SUM(年度の予定・記録!X10:X64)","v":{"v":358500,"d":"¥358,500"}}]
[{"$nulls":19},{"$f":"IFERROR(VLOOKUP(6,年度の予定・記録!$B$10:$K$64,7,FALSE),\"\")","v":"2021-10-12"},null,null,{"$f":"IFERROR(VLOOKUP(6,年度の予定・記録!$B$10:$K$64,10,FALSE),\"\")","v":"第2回分会執行委員会"},{"$nulls":5},{"$f":"IFERROR(VLOOKUP(38,年度の予定・記録!$B$10:$K$64,7,FALSE),\"\")","v":""},null,null,{"$f":"IFERROR(VLOOKUP(38,年度の予定・記録!$B$10:$K$64,10,FALSE),\"\")","v":""}]
[{"$nulls":11},"７．","分会執行委員長挨拶",{"$nulls":6},{"$f":"IFERROR(VLOOKUP(7,年度の予定・記録!$B$10:$K$64,7,FALSE),\"\")","v":"2021-10-20"},null,null,{"$f":"IFERROR(VLOOKUP(7,年度の予定・記録!$B$10:$K$64,10,FALSE),\"\")","v":"第1回分会集会"},{"$nulls":5},{"$f":"IFERROR(VLOOKUP(39,年度の予定・記録!$B$10:$K$64,7,FALSE),\"\")","v":""},null,null,{"$f":"IFERROR(VLOOKUP(39,年度の予定・記録!$B$10:$K$64,10,FALSE),\"\")","v":""},{"$nulls":5},"活動調査費",null,{"$f":"データリスト!G33","v":{"v":135000,"d":"¥135,000"}},null,{"$f":"SUMIF(年度の予定・記録!W10:Y64,AL18,年度の予定・記録!Y10:Y64)","v":{"v":120000,"d":"¥120,000"}},null,"申請金額　　　　　（組織活動費）",null,0,null,{"$f":"SUMIF(年度の予定・記録!W10:Y64,\"申請金額\",年度の予定・記録!X10:X64)","v":{"v":170000,"d":"(¥　　170,000)"}}]
[{"$nulls":19},{"$f":"IFERROR(VLOOKUP(8,年度の予定・記録!$B$10:$K$64,7,FALSE),\"\")","v":"2021-11-15"},null,null,{"$f":"IFERROR(VLOOKUP(8,年度の予定・記録!$B$10:$K$64,10,FALSE),\"\")","v":"第3回分会執行委員会"},{"$nulls":5},{"$f":"IFERROR(VLOOKUP(40,年度の予定・記録!$B$10:$K$64,7,FALSE),\"\")","v":""},null,null,{"$f":"IFERROR(VLOOKUP(40,年度の予定・記録!$B$10:$K$64,10,FALSE),\"\")","v":""}]
[{"$nulls":11},"８．","来賓挨拶",{"$nulls":6},{"$f":"IFERROR(VLOOKUP(9,年度の予定・記録!$B$10:$K$64,7,FALSE),\"\")","v":"2021-11-20"},null,null,{"$f":"IFERROR(VLOOKUP(9,年度の予定・記録!$B$10:$K$64,10,FALSE),\"\")","v":"電力地協　代表者会議"},{"$nulls":5},{"$f":"IFERROR(VLOOKUP(41,年度の予定・記録!$B$10:$K$64,7,FALSE),\"\")","v":""},null,null,{"$f":"IFERROR(VLOOKUP(41,年度の予定・記録!$B$10:$K$64,10,FALSE),\"\")","v":""},{"$nulls":5},"組織活動費",null,{"$f":"データリスト!H33","v":{"v":198100,"d":"¥198,100"}},null,{"$f":"SUMIF(年度の予定・記録!W10:Y64,AL20,年度の予定・記録!Y10:Y64)","v":{"v":146766,"d":"¥146,766"}},null,"受取利息",null,0,null,{"$f":"データリスト!F28","v":{"v":1,"d":"¥1"}}]
[{"$nulls":19},{"$f":"IFERROR(VLOOKUP(10,年度の予定・記録!$B$10:$K$64,7,FALSE),\"\")","v":"2021-11-24"},null,null,{"$f":"IFERROR(VLOOKUP(10,年度の予定・記録!$B$10:$K$64,10,FALSE),\"\")","v":"安全衛生委員会"},{"$nulls":5},{"$f":"IFERROR(VLOOKUP(42,年度の予定・記録!$B$10:$K$64,7,FALSE),\"\")","v":""},null,null,{"$f":"IFERROR(VLOOKUP(42,年度の予定・記録!$B$10:$K$64,10,FALSE),\"\")","v":""}]
[{"$nulls":11},"９．","経過報告",{"$nulls":6},{"$f":"IFERROR(VLOOKUP(11,年度の予定・記録!$B$10:$K$64,7,FALSE),\"\")","v":"2021-11-24"},null,null,{"$f":"IFERROR(VLOOKUP(11,年度の予定・記録!$B$10:$K$64,10,FALSE),\"\")","v":"労使協議会"},{"$nulls":5},{"$f":"IFERROR(VLOOKUP(43,年度の予定・記録!$B$10:$K$64,7,FALSE),\"\")","v":""},null,null,{"$f":"IFERROR(VLOOKUP(43,年度の予定・記録!$B$10:$K$64,10,FALSE),\"\")","v":""},{"$nulls":5},"申請金額　　　　　（組織活動費）",null,0,null,{"$f":"AV18","v":{"v":170000,"d":"¥170,000"}},null,"前年度繰越金",null,{"$f":"データリスト!I26","v":{"v":13618,"d":"¥13,618"}},null,{"$f":"データリスト!I26","v":{"v":13618,"d":"¥13,618"}}]
[{"$nulls":12},{"$f":"\"（１）　\"&データリスト!F68&\"年度活動経過報告\"","v":"（１）　2021年度活動経過報告"},{"$nulls":6},{"$f":"IFERROR(VLOOKUP(12,年度の予定・記録!$B$10:$K$64,7,FALSE),\"\")","v":"2021-12-15"},null,null,{"$f":"IFERROR(VLOOKUP(12,年度の予定・記録!$B$10:$K$64,10,FALSE),\"\")","v":"分会クリスマス会第1回実行委員会"},{"$nulls":5},{"$f":"IFERROR(VLOOKUP(44,年度の予定・記録!$B$10:$K$64,7,FALSE),\"\")","v":""},null,null,{"$f":"IFERROR(VLOOKUP(44,年度の予定・記録!$B$10:$K$64,10,FALSE),\"\")","v":""}]
[{"$nulls":12},{"$f":"\"（２）　\"&データリスト!F68&\"年度会計報告\"","v":"（２）　2021年度会計報告"},{"$nulls":6},{"$f":"IFERROR(VLOOKUP(13,年度の予定・記録!$B$10:$K$64,7,FALSE),\"\")","v":"2021-12-22"},null,null,{"$f":"IFERROR(VLOOKUP(13,年度の予定・記録!$B$10:$K$64,10,FALSE),\"\")","v":"分会クリスマス会第2回実行委員会"},{"$nulls":5},{"$f":"IFERROR(VLOOKUP(45,年度の予定・記録!$B$10:$K$64,7,FALSE),\"\")","v":""},null,null,{"$f":"IFERROR(VLOOKUP(45,年度の予定・記録!$B$10:$K$64,10,FALSE),\"\")","v":""},{"$nulls":5},"大会費",null,{"$f":"データリスト!I33","v":{"v":16100,"d":"¥16,100"}},null,{"$f":"SUMIF(年度の予定・記録!W10:Y64,AL24,年度の予定・記録!Y10:Y64)","v":{"v":12340,"d":"¥12,340"}}]
[{"$nulls":12},{"$f":"\"（３）　\"&データリスト!F68&\"年度会計監査報告\"","v":"（３）　2021年度会計監査報告"},{"$nulls":6},{"$f":"IFERROR(VLOOKUP(14,年度の予定・記録!$B$10:$K$64,7,FALSE),\"\")","v":"2021-12-24"},null,null,{"$f":"IFERROR(VLOOKUP(14,年度の予定・記録!$B$10:$K$64,10,FALSE),\"\")","v":"分会クリスマス会"},{"$nulls":5},{"$f":"IFERROR(VLOOKUP(46,年度の予定・記録!$B$10:$K$64,7,FALSE),\"\")","v":""},null,null,{"$f":"IFERROR(VLOOKUP(46,年度の予定・記録!$B$10:$K$64,10,FALSE),\"\")","v":""}]
[{"$nulls":19},{"$f":"IFERROR(VLOOKUP(15,年度の予定・記録!$B$10:$K$64,7,FALSE),\"\")","v":"2022-01-13"},null,null,{"$f":"IFERROR(VLOOKUP(15,年度の予定・記録!$B$10:$K$64,10,FALSE),\"\")","v":"労使パトロール"},{"$nulls":5},{"$f":"IFERROR(VLOOKUP(47,年度の予定・記録!$B$10:$K$64,7,FALSE),\"\")","v":""},null,null,{"$f":"IFERROR(VLOOKUP(47,年度の予定・記録!$B$10:$K$64,10,FALSE),\"\")","v":""},{"$nulls":5},"予備費",null,{"$f":"データリスト!I26","v":{"v":13618,"d":"¥13,618"}},null,{"$f":"SUMIF(年度の予定・記録!W10:Y64,AL26,年度の予定・記録!Y10:Y64)","v":0}]
[{"$nulls":11},"10．","活動報告に対する質疑討論",{"$nulls":6},{"$f":"IFERROR(VLOOKUP(16,年度の予定・記録!$B$10:$K$64,7,FALSE),\"\")","v":"2022-01-13"},null,null,{"$f":"IFERROR(VLOOKUP(16,年度の予定・記録!$B$10:$K$64,10,FALSE),\"\")","v":"安全衛生委員会"},{"$nulls":5},{"$f":"IFERROR(VLOOKUP(48,年度の予定・記録!$B$10:$K$64,7,FALSE),\"\")","v":""},null,null,{"$f":"IFERROR(VLOOKUP(48,年度の予定・記録!$B$10:$K$64,10,FALSE),\"\")","v":""}]
[{"$nulls":19},{"$f":"IFERROR(VLOOKUP(17,年度の予定・記録!$B$10:$K$64,7,FALSE),\"\")","v":"2022-01-14"},null,null,{"$f":"IFERROR(VLOOKUP(17,年度の予定・記録!$B$10:$K$64,10,FALSE),\"\")","v":"第4回分会執行委員会"},{"$nulls":5},{"$f":"IFERROR(VLOOKUP(49,年度の予定・記録!$B$10:$K$64,7,FALSE),\"\")","v":""},null,null,{"$f":"IFERROR(VLOOKUP(49,年度の予定・記録!$B$10:$K$64,10,FALSE),\"\")","v":""},{"$nulls":5},"支出計",null,{"$f":"SUM(AN16:AO21,AN24,AN26)","v":{"v":400218,"d":"¥400,218"}},null,{"$f":"AP16+AP18+AP20+AP24+AP26","v":{"v":279106,"d":"¥279,106"}},null,"収入計",null,{"$f":"SUM(AT16:AU27)","v":{"v":400218,"d":"¥400,218"}},null,{"$f":"AV16+AV20+AV22","v":{"v":372119,"d":"¥372,119"}}]
[{"$nulls":11},"11．","議　　事",{"$nulls":6},{"$f":"IFERROR(VLOOKUP(18,年度の予定・記録!$B$10:$K$64,7,FALSE),\"\")","v":"2022-01-16"},null,null,{"$f":"IFERROR(VLOOKUP(18,年度の予定・記録!$B$10:$K$64,10,FALSE),\"\")","v":"分会委員長連絡会議"},{"$nulls":5},{"$f":"IFERROR(VLOOKUP(50,年度の予定・記録!$B$10:$K$64,7,FALSE),\"\")","v":""},null,null,{"$f":"IFERROR(VLOOKUP(50,年度の予定・記録!$B$10:$K$64,10,FALSE),\"\")","v":""}]
[{"$nulls":12},{"$f":"\"（１）　第一号議案　　\"&データリスト!F68+1&\"年度活動方針について\"","v":"（１）　第一号議案　　2022年度活動方針について"},{"$nulls":6},{"$f":"IFERROR(VLOOKUP(19,年度の予定・記録!$B$10:$K$64,7,FALSE),\"\")","v":"2022-02-17"},null,null,{"$f":"IFERROR(VLOOKUP(19,年度の予定・記録!$B$10:$K$64,10,FALSE),\"\")","v":"分会ボウリング大会第1回実行委員会"},{"$nulls":5},{"$f":"IFERROR(VLOOKUP(51,年度の予定・記録!$B$10:$K$64,7,FALSE),\"\")","v":""},null,null,{"$f":"IFERROR(VLOOKUP(51,年度の予定・記録!$B$10:$K$64,10,FALSE),\"\")","v":""},{"$nulls":5},"繰越金",null,0,null,{"$f":"AV28-AP28","v":{"v":93013,"d":"¥93,013"}},{"$nulls":10},{"$f":"TEXT(A36,\"ggge年ｍ月ｄ日（aaa）\")","v":"令和4年9月6日(火)"}]
[{"$nulls":12},{"$f":"\"（２）　第二号議案　　\"&データリスト!F68&\"年度収支剰余金処理について\"","v":"（２）　第二号議案　　2021年度収支剰余金処理について"},{"$nulls":6},{"$f":"IFERROR(VLOOKUP(20,年度の予定・記録!$B$10:$K$64,7,FALSE),\"\")","v":"2022-02-27"},null,null,{"$f":"IFERROR(VLOOKUP(20,年度の予定・記録!$B$10:$K$64,10,FALSE),\"\")","v":"分会ボウリング大会第2回実行委員会"},{"$nulls":5},{"$f":"IFERROR(VLOOKUP(52,年度の予定・記録!$B$10:$K$64,7,FALSE),\"\")","v":""},null,null,{"$f":"IFERROR(VLOOKUP(52,年度の予定・記録!$B$10:$K$64,10,FALSE),\"\")","v":""}]
[{"$nulls":12},{"$f":"\"（３）　第三号議案　　\"&データリスト!F68+1&\"年度予算について\"","v":"（３）　第三号議案　　2022年度予算について"},{"$nulls":6},{"$f":"IFERROR(VLOOKUP(21,年度の予定・記録!$B$10:$K$64,7,FALSE),\"\")","v":"2022-02-27"},null,null,{"$f":"IFERROR(VLOOKUP(21,年度の予定・記録!$B$10:$K$64,10,FALSE),\"\")","v":"分会ボウリング大会"},{"$nulls":5},{"$f":"IFERROR(VLOOKUP(53,年度の予定・記録!$B$10:$K$64,7,FALSE),\"\")","v":""},null,null,{"$f":"IFERROR(VLOOKUP(53,年度の予定・記録!$B$10:$K$64,10,FALSE),\"\")","v":""},{"$nulls":5},"総合計",null,{"$f":"SUM(AN16:AO27)","v":{"v":400218,"d":"¥400,218"}},null,{"$f":"SUM(AP28:AQ31)","v":{"v":372119,"d":"¥372,119"}},null,"総合計",null,{"$f":"SUM(AT16,AT20,AT22)","v":{"v":400218,"d":"¥400,218"}},null,{"$f":"AV28","v":{"v":372119,"d":"¥372,119"}}]
[{"$nulls":12},{"$f":"\"（４）　第四号議案　　\"&データリスト!F68+1&\"年度分会役員について\"","v":"（４）　第四号議案　　2022年度分会役員について"},{"$nulls":6},{"$f":"IFERROR(VLOOKUP(22,年度の予定・記録!$B$10:$K$64,7,FALSE),\"\")","v":""},null,null,{"$f":"IFERROR(VLOOKUP(22,年度の予定・記録!$B$10:$K$64,10,FALSE),\"\")","v":""},{"$nulls":5},{"$f":"IFERROR(VLOOKUP(54,年度の予定・記録!$B$10:$K$64,7,FALSE),\"\")","v":""},null,null,{"$f":"IFERROR(VLOOKUP(54,年度の予定・記録!$B$10:$K$64,10,FALSE),\"\")","v":""},{"$nulls":17},{"$f":"\"ユアテックユニオン\"&データリスト!F4&\"分会\"","v":"ユアテックユニオン福島分会"}]
[null,null,"開催日時",{"$nulls":16},{"$f":"IFERROR(VLOOKUP(23,年度の予定・記録!$B$10:$K$64,7,FALSE),\"\")","v":""},null,null,{"$f":"IFERROR(VLOOKUP(23,年度の予定・記録!$B$10:$K$64,10,FALSE),\"\")","v":""},{"$nulls":5},{"$f":"IFERROR(VLOOKUP(55,年度の予定・記録!$B$10:$K$64,7,FALSE),\"\")","v":""},null,null,{"$f":"IFERROR(VLOOKUP(55,年度の予定・記録!$B$10:$K$64,10,FALSE),\"\")","v":""}]
[{"$nulls":11},"12．","議案に対する質疑応答",{"$nulls":6},{"$f":"IFERROR(VLOOKUP(24,年度の予定・記録!$B$10:$K$64,7,FALSE),\"\")","v":""},null,null,{"$f":"IFERROR(VLOOKUP(24,年度の予定・記録!$B$10:$K$64,10,FALSE),\"\")","v":""},{"$nulls":5},{"$f":"IFERROR(VLOOKUP(56,年度の予定・記録!$B$10:$K$64,7,FALSE),\"\")","v":""},null,null,{"$f":"IFERROR(VLOOKUP(56,年度の予定・記録!$B$10:$K$64,10,FALSE),\"\")","v":""},{"$nulls":5},"※ 組織活動費については、予備費(繰越金)を優先に消化し、不足した時に本部に申請用紙を届け出ます。",{"$nulls":11},{"$f":"\"第\"&データリスト!I6&\"回\"&\"分会\"&データリスト!F21&\"大会議長殿\"","v":"第59回分会定期大会議長殿"}]
[{"$f":"データリスト!F19","v":"2022-09-06T18:30:00"},{"$nulls":18},{"$f":"IFERROR(VLOOKUP(25,年度の予定・記録!$B$10:$K$64,7,FALSE),\"\")","v":""},null,null,{"$f":"IFERROR(VLOOKUP(25,年度の予定・記録!$B$10:$K$64,10,FALSE),\"\")","v":""},{"$nulls":5},{"$f":"IFERROR(VLOOKUP(57,年度の予定・記録!$B$10:$K$64,7,FALSE),\"\")","v":""},null,null,{"$f":"IFERROR(VLOOKUP(57,年度の予定・記録!$B$10:$K$64,10,FALSE),\"\")","v":""}]
[{"$nulls":11},"13．","役員選出",{"$nulls":6},{"$f":"IFERROR(VLOOKUP(26,年度の予定・記録!$B$10:$K$64,7,FALSE),\"\")","v":""},null,null,{"$f":"IFERROR(VLOOKUP(26,年度の予定・記録!$B$10:$K$64,10,FALSE),\"\")","v":""},{"$nulls":5},{"$f":"IFERROR(VLOOKUP(58,年度の予定・記録!$B$10:$K$64,7,FALSE),\"\")","v":""},null,null,{"$f":"IFERROR(VLOOKUP(58,年度の予定・記録!$B$10:$K$64,10,FALSE),\"\")","v":""},{"$nulls":5},"※【支出の部】『組織活動費』については予算としては計上されますが、一律交付はされず分会で活動を"]
[{"$nulls":19},{"$f":"IFERROR(VLOOKUP(27,年度の予定・記録!$B$10:$K$64,7,FALSE),\"\")","v":""},null,null,{"$f":"IFERROR(VLOOKUP(27,年度の予定・記録!$B$10:$K$64,10,FALSE),\"\")","v":""},{"$nulls":5},{"$f":"IFERROR(VLOOKUP(59,年度の予定・記録!$B$10:$K$64,7,FALSE),\"\")","v":""},null,null,{"$f":"IFERROR(VLOOKUP(59,年度の予定・記録!$B$10:$K$64,10,FALSE),\"\")","v":""},{"$nulls":5},"　計画し、予算額を申請することで交付されます。",{"$nulls":14},"分会会計監査員"]
[{"$nulls":11},"14．","新旧役員挨拶",{"$nulls":6},{"$f":"IFERROR(VLOOKUP(28,年度の予定・記録!$B$10:$K$64,7,FALSE),\"\")","v":""},null,null,{"$f":"IFERROR(VLOOKUP(28,年度の予定・記録!$B$10:$K$64,10,FALSE),\"\")","v":""},{"$nulls":5},{"$f":"IFERROR(VLOOKUP(60,年度の予定・記録!$B$10:$K$64,7,FALSE),\"\")","v":""},null,null,{"$f":"IFERROR(VLOOKUP(60,年度の予定・記録!$B$10:$K$64,10,FALSE),\"\")","v":""}]
[{"$f":"データリスト!I19","v":"別館会議室２F"},{"$nulls":18},{"$f":"IFERROR(VLOOKUP(29,年度の予定・記録!$B$10:$K$64,7,FALSE),\"\")","v":""},null,null,{"$f":"IFERROR(VLOOKUP(29,年度の予定・記録!$B$10:$K$64,10,FALSE),\"\")","v":""},{"$nulls":5},{"$f":"IFERROR(VLOOKUP(61,年度の予定・記録!$B$10:$K$64,7,FALSE),\"\")","v":""},null,null,{"$f":"IFERROR(VLOOKUP(61,年度の予定・記録!$B$10:$K$64,10,FALSE),\"\")","v":""},{"$nulls":5},"※【収入の部】申請額については括弧内の通り。科目[分会交付金]の[実績]欄には申請額が含まれています。",{"$nulls":19},"㊞"]
[{"$nulls":11},"15．","議長団解任",{"$nulls":6},{"$f":"IFERROR(VLOOKUP(30,年度の予定・記録!$B$10:$K$64,7,FALSE),\"\")","v":""},null,null,{"$f":"IFERROR(VLOOKUP(30,年度の予定・記録!$B$10:$K$64,10,FALSE),\"\")","v":""},{"$nulls":5},{"$f":"IFERROR(VLOOKUP(62,年度の予定・記録!$B$10:$K$64,7,FALSE),\"\")","v":""},null,null,{"$f":"IFERROR(VLOOKUP(62,年度の予定・記録!$B$10:$K$64,10,FALSE),\"\")","v":""}]
[{"$nulls":19},{"$f":"IFERROR(VLOOKUP(31,年度の予定・記録!$B$10:$K$64,7,FALSE),\"\")","v":""},null,null,{"$f":"IFERROR(VLOOKUP(31,年度の予定・記録!$B$10:$K$64,10,FALSE),\"\")","v":""},{"$nulls":5},{"$f":"IFERROR(VLOOKUP(63,年度の予定・記録!$B$10:$K$64,7,FALSE),\"\")","v":""},null,null,{"$f":"IFERROR(VLOOKUP(63,年度の予定・記録!$B$10:$K$64,10,FALSE),\"\")","v":""}]
[{"$nulls":11},"16．","閉会の挨拶",{"$nulls":6},{"$f":"IFERROR(VLOOKUP(32,年度の予定・記録!$B$10:$K$64,7,FALSE),\"\")","v":""},null,null,{"$f":"IFERROR(VLOOKUP(32,年度の予定・記録!$B$10:$K$64,10,FALSE),\"\")","v":""},{"$nulls":5},{"$f":"IFERROR(VLOOKUP(64,年度の予定・記録!$B$10:$K$64,7,FALSE),\"\")","v":""},null,null,{"$f":"IFERROR(VLOOKUP(64,年度の予定・記録!$B$10:$K$64,10,FALSE),\"\")","v":""}]
[{"$nulls":37},"【　第四号議案　】"]
["【　第一号議案　】",{"$nulls":18},"【　第二号議案　】"]
[{"$nulls":37},{"$f":"データリスト!F2&\"年度　執行委員\"","v":"2021年度　執行委員"}]
[null,{"$f":"データリスト!F2+1&\"年度活動方針（案）\"","v":"2022年度活動方針（案）"},{"$nulls":9},"具体的活動について",{"$nulls":9},{"$f":"データリスト!F2&\"年度収支剰余金処理\"","v":"2021年度収支剰余金処理"},{"$nulls":28},"お　わ　り　に"]
[]
[]
[null,"～活動を進めるにあたっての基調～",{"$nulls":18},{"$f":"データリスト!F2&\"年度会計収支剰余金\"","v":"2021年度会計収支剰余金"},{"$nulls":8},{"$f":"IF(AP30<0,0,AP30)","v":{"v":93013,"d":"¥93,013"}},{"$nulls":4},"を、",null,null,{"$f":"データリスト!F11","v":"　　分会執行委員長"},{"$nulls":4},{"$f":"IF(AL50=データリスト!F11,データリスト!F13,\"\")","v":"A"},null,null,{"$f":"PHONETIC(データリスト!F13)","v":"A"}]
[{"$nulls":11},{"$f":"データリスト!F40","v":"～生きいきとした存在感ある組織づくりをめざして～"}]
[{"$nulls":20},{"$f":"データリスト!F2+1&\"年度会計に繰入れ処理する。\"","v":"2022年度会計に繰入れ処理する。"},{"$nulls":16},{"$f":"IF(データリスト!G13=\"\",\"\",データリスト!G11)","v":"　　分会執行副委員長"},{"$nulls":4},{"$f":"IF(データリスト!G13=\"\",\"\",データリスト!G13)","v":"B"},null,null,{"$f":"IF(データリスト!G13=\"\",\"\",PHONETIC(データリスト!G13))","v":"B"},{"$nulls":4},"各執行委員の努力と全組合員の"]
[{"$f":"データリスト!F38","v":"がんばるベア！！"},{"$nulls":10},{"$f":"IF(データリスト!F41=\"\",\"\",データリスト!F41)","v":"・生きいきとした存在感ある組織づくりを目指して\n・頼りがいのある生活支援機能の充実を目指して\n・仲間との連携活動の強化を目指して豊かでゆとりあるライフステージの実現を目指して"}]
[{"$nulls":37},{"$f":"データリスト!H11","v":"　　分会書記長"},{"$nulls":4},{"$f":"データリスト!H13","v":"C"},null,null,{"$f":"PHONETIC(データリスト!H13)","v":"C"}]
[{"$nulls":19},"【　第三号議案　】"]
[{"$nulls":37},{"$f":"IF(データリスト!G13=\"\",\"\",データリスト!I11)","v":"　　分会執行委員"},{"$nulls":4},{"$f":"IF(データリスト!G13=\"\",\"\",データリスト!I13)","v":"D"},null,null,{"$f":"IF(データリスト!G13=\"\",\"\",PHONETIC(データリスト!I13))","v":"D"},{"$nulls":4},"あたたかい協力により、分会活動も一歩前進ができましたことを"]
[{"$nulls":11},{"$f":"データリスト!H40","v":"～頼りがいのある生活支援機能の充実をめざして～"},{"$nulls":9},{"$f":"データリスト!F2+1&\"年度予算（案）\"","v":"2022年度予算（案）"}]
[{"$nulls":37},{"$f":"IF(データリスト!G13=\"\",データリスト!K11,データリスト!J11)","v":"　　分会執行委員"},{"$nulls":4},{"$f":"IF(データリスト!G13=\"\",データリスト!K13,データリスト!J13)","v":"E"},null,null,{"$f":"IF(データリスト!G13=\"\",PHONETIC(データリスト!K13),PHONETIC(データリスト!J13))","v":"E"}]
[{"$nulls":11},{"$f":"IF(データリスト!H41=\"\",\"\",データリスト!H41)","v":"何としても頑張る"}]
[{"$nulls":37},{"$f":"IF(データリスト!G13=\"\",\"\",データリスト!K11)","v":"　　分会会計監査員"},{"$nulls":4},{"$f":"IF(データリスト!G13=\"\",\"\",データリスト!K13)","v":"F"},null,null,{"$f":"IF(データリスト!G13=\"\",\"\",PHONETIC(データリスト!K13))","v":"F"},{"$nulls":4},"感謝すると共に、明るく楽しい職場作りのため、みなさんから意見"]
[{"$nulls":19},"支出の部",{"$nulls":8},"収入の部"]
[]
[{"$nulls":11},{"$f":"データリスト!J40","v":"～仲間との連携活動の強化をめざして～"}]
[{"$nulls":50},"要望を聞き入れ、一人、一人が組合を支えているということを再確"]
[{"$nulls":11},{"$f":"IF(データリスト!J41=\"\",\"\",データリスト!J41)","v":"たまに息抜き"},{"$nulls":7},"科目",{"$nulls":3},"金額",{"$nulls":4},"科目",{"$nulls":3},"金額",{"$nulls":4},{"$f":"データリスト!F2+1&\"年度　新執行委員（案）\"","v":"2022年度　新執行委員（案）"}]
[]
[]
[{"$nulls":19},"総務費",{"$nulls":3},{"$f":"データリスト!F34","v":0},{"$nulls":4},"分会交付金",{"$nulls":3},{"$f":"データリスト!F30","v":0},{"$nulls":17},"認していただき、なお一層のご支援をよろしくお願いいたします。"]
[{"$nulls":11},{"$f":"データリスト!L40","v":"～豊かでゆとりあるライフステージの実現をめざして～"},{"$nulls":25},{"$f":"データリスト!F11","v":"　　分会執行委員長"},{"$nulls":4},{"$f":"IF(AL69=データリスト!F11,データリスト!F12,\"\")","v":"あ"},null,null,{"$f":"PHONETIC(データリスト!F12)","v":"ア"}]
[]
["　　１・友愛と信義に満ちた生きいきとした組織づくり",{"$nulls":10},{"$f":"IF(データリスト!L41=\"\",\"\",データリスト!L41)","v":"そして頑張る"},{"$nulls":7},"活動調査費",{"$nulls":3},{"$f":"データリスト!G34","v":0},{"$nulls":4},"前年度繰越金",{"$nulls":3},{"$f":"AP30","v":{"v":93013,"d":"¥93,013"}},{"$nulls":4},{"$f":"IF(データリスト!G12=\"\",\"\",データリスト!G11)","v":"　　分会執行副委員長"},{"$nulls":4},{"$f":"IF(データリスト!G12=\"\",\"\",データリスト!G12)","v":"い"},null,null,{"$f":"IF(データリスト!G12=\"\",\"\",PHONETIC(データリスト!G12))","v":"イ"}]
[]
[{"$nulls":37},{"$f":"データリスト!H11","v":"　　分会書記長"},{"$nulls":4},{"$f":"データリスト!H12","v":"う"},null,null,{"$f":"PHONETIC(データリスト!H12)","v":"ウ"}]
[{"$nulls":19},"組織活動費",{"$nulls":3},{"$f":"データリスト!H34","v":0}]
["　　２・「ユアテックユニオンの進路」に基づく活動展開",{"$nulls":10},{"$f":"データリスト!N40","v":"～安全で健康な明るい職場の確立をめざして～"},{"$nulls":25},{"$f":"IF(データリスト!G12=\"\",\"\",データリスト!I11)","v":"　　分会執行委員"},{"$nulls":4},{"$f":"IF(データリスト!G12=\"\",\"\",データリスト!I12)","v":"え"},null,null,{"$f":"IF(データリスト!G12=\"\",\"\",PHONETIC(データリスト!I12))","v":"エ"}]
[]
[{"$nulls":11},{"$f":"IF(データリスト!N41=\"\",\"\",データリスト!N41)","v":"さらに頑張る"},{"$nulls":7},"大会費",{"$nulls":3},{"$f":"データリスト!I34","v":0},{"$nulls":13},{"$f":"IF(データリスト!G12=\"\",データリスト!K11,データリスト!J11)","v":"　　分会執行委員"},{"$nulls":4},{"$f":"IF(データリスト!G12=\"\",データリスト!K12,データリスト!J12)","v":"お"},null,null,{"$f":"IF(データリスト!G12=\"\",PHONETIC(データリスト!K12),PHONETIC(データリスト!J12))","v":"オ"}]
[]
["　　３・人間性と効率性が調和した職場づくり",{"$nulls":36},{"$f":"IF(データリスト!G12=\"\",\"\",データリスト!K11)","v":"　　分会会計監査員"},{"$nulls":4},{"$f":"IF(データリスト!G12=\"\",\"\",データリスト!K12)","v":"か"},null,null,{"$f":"IF(データリスト!G12=\"\",\"\",PHONETIC(データリスト!K12))","v":"カ"}]
[{"$nulls":19},"予備費",{"$nulls":3},{"$f":"データリスト!J34","v":{"v":93013,"d":"¥93,013"}}]
[{"$nulls":11},{"$f":"データリスト!P40","v":"～創造的で活力ある職場風土をめざして～"}]
[]
["　　４・魅力ある産業、豊かな社会づくりへの参画",{"$nulls":10},{"$f":"IF(データリスト!P41=\"\",\"\",データリスト!P41)","v":"神になる"},{"$nulls":7},"合計",{"$nulls":3},{"$f":"SUM(X68:AB82)","v":{"v":93013,"d":"¥93,013"}},{"$nulls":4},"合計",{"$nulls":3},{"$f":"SUM(AG68:AK82)","v":{"v":93013,"d":"¥93,013"}}]
[]
[{"$nulls":37},"＊　分会規約第28条および第31条により、職場委員の指名は分会執行委員が行なう。"]
[{"$nulls":23},{"$f":"SUM(X68:AB79)","v":{"v":0,"d":"¥0"}}]

{"sheet":"議長議事進行メモ","index":7,"n_rows":190,"n_cols":19,"rows_kept":190,"merged":[[0,1,0,21],[1,5,1,20],[2,5,2,20],[5,5,5,20],[7,5,7,20],[8,5,8,20],[9,5,9,20],[10,5,11,20],[12,5,12,20],[13,5,13,20],[14,5,14,20],[15,5,15,20],[16,5,16,20],[17,5,17,20],[18,5,18,20],[19,5,19,20],[20,5,20,20],[21,5,21,20],[22,5,22,20],[23,5,23,20],[24,5,24,20],[25,5,25,20],[26,5,26,20],[27,5,27,20],[28,5,28,20],[29,5,29,20],[30,5,30,20],[31,5,31,20],[32,5,32,20],[33,5,33,20],[34,5,34,20],[35,5,35,20],[36,1,36,21],[37,5,37,10],[37,12,37,20],[38,5,38,7],[38,8,38,10],[38,12,44,20],[39,1,39,2],[39,5,71,7],[39,8,71,10],[45,12,45,15],[45,16,45,20],[46,12,51,15],[46,16,51,20],[52,12,52,20],[53,12,53,14],[53,15,53,17],[53,18,53,20],[54,12,64,14],[54,15,64,17],[54,18,64,20],[65,12,65,20],[66,12,66,15],[66,16,66,20],[67,12,71,15],[67,16,71,20],[72,1,72,21],[84,5,84,11],[84,13,84,20],[89,13,89,16],[89,17,89,20],[90,17,90,20],[111,1,111,21],[125,5,125,11],[125,13,125,20],[130,13,130,16],[130,17,130,20],[151,1,151,21]]}
[null,{"$f":"\"第\"&データリスト!I6&\"回\"&データリスト!F4&\"分会　\"&データリスト!F21&\"大会議事進行メモ①\"","v":"第59回福島分会　定期大会議事進行メモ①"}]
[null,"１．司会者挨拶",null,{"$f":"データリスト!F24","v":"花見"},null,"御集りの皆様、御苦労様です。"]
[{"$nulls":5},"本日は、お忙しい中お集りいただき、大変ありがとうございます。"]
[{"$nulls":5},{"$f":"\"本日の司会進行をさせていただきます、\"&データリスト!F24&\"でございます。\"","v":"本日の司会進行をさせていただきます、花見でございます。"}]
[{"$nulls":5},"どうぞよろしくお願いします。"]
[{"$nulls":5},{"$f":"\"さっそくではありますが、只今より第\"&データリスト!I6&\"回\"&データリスト!F4&\"分会\"&データリスト!F21&\"大会を開催いたします。\"","v":"さっそくではありますが、只今より第59回福島分会定期大会を開催いたします。"}]
[]
[null,"２．資格審査",null,{"$f":"データリスト!F24","v":"花見"},null,"これより資格審査を行います、資格審査員の方よろしくお願いします。"]
[{"$nulls":3},{"$f":"データリスト!G24","v":"冨塚"},null,{"$f":"\"資格審査員の\"&データリスト!G24&\"です。\"","v":"資格審査員の冨塚です。"}]
[{"$nulls":5},{"$f":"データリスト!F4&\"分会の組合員数は今日現在　\"&データリスト!I4&\"名であり、\"","v":"福島分会の組合員数は今日現在　37名であり、"}]
[null,"＊当日の人数を確認して報告",{"$nulls":3},"本日出席を確認した組合員数は　　　　　名、委任状提出者は　　　　　名となっております。"]
[]
[null,"３．大会成立宣言",null,{"$f":"データリスト!H24","v":"冨塚"},null,"ただ今の報告により、分会規約第１０条の委任出席を含め分会組合員数の３分の２以上の出席の要件を満たしておりますので、大会が成立していることを宣言いたします。"]
[]
[null,"４．大会議長団選出",null,{"$f":"データリスト!F24","v":"花見"},null,"それではこれより、大会議長の選出に入りたいと思いますが、議長については、腹案がありますので、発表し承認していただきたいと思いますが、ご異議ございませんか？"]
[{"$nulls":3},"会場",null,"　　（異議無しの声)"]
[{"$nulls":3},{"$f":"データリスト!F24","v":"花見"},null,{"$f":"\"それでは大会議長に、\"&データリスト!I24&\"さんにお願いしたいと思います。\"","v":"それでは大会議長に、佐藤さんにお願いしたいと思います。"}]
[{"$nulls":5},{"$f":"データリスト!I24&\"さん、御登壇お願います。\"","v":"佐藤さん、御登壇お願います。"}]
[{"$nulls":3},{"$f":"データリスト!I24","v":"佐藤"},null,"　　（議長席へ移動　　議長席の脇で起立のまま待機）"]
[{"$nulls":3},{"$f":"データリスト!F24","v":"花見"},null,"大会議長が決定しましたので、これ以降の議事進行については議長にお願いします。ご協力有難うございました。"]
[{"$nulls":5},"　　（司会席へ移動、着席）"]
[]
[null,"５．議長団挨拶",null,{"$f":"データリスト!I24","v":"佐藤"},null,{"$f":"\"ただ今、本大会の議長に選任されました、\"&データリスト!I24&\"でございます。\"","v":"ただ今、本大会の議長に選任されました、佐藤でございます。"}]
[{"$nulls":5},"大変不慣れではございますが、スムーズな議事進行に努めて行きたいと思いますので、皆様のご協力を宜しくお願いします。"]
[{"$nulls":5},"　　（一礼後、議長席へ着席）"]
[]
[null,"６．大会書記任命",null,{"$f":"データリスト!I24","v":"佐藤"},null,"それでは、これより大会書記を任命いたします。氏名を発表し、ご承認を得たいと思いますが、異議ございませんか？\n"]
[{"$nulls":3},"会場",null,"　　（異議無しの声)"]
[{"$nulls":3},{"$f":"データリスト!I24","v":"佐藤"},null,"有難うございます。"]
[{"$nulls":5},{"$f":"\"それでは、氏名を発表いたします。\"&データリスト!J24&\"さん、よろしくお願いします。\"","v":"それでは、氏名を発表いたします。元内さん、よろしくお願いします。"}]
[{"$nulls":3},{"$f":"データリスト!J24","v":"元内"},null,"　　（その場で起立・一礼・着席）"]
[]
[null,"７．分会執行委員長挨拶",null,{"$f":"データリスト!I24","v":"佐藤"},null,"それでは、ここで、分会執行部代表の挨拶を受けたいと思います。"]
[{"$nulls":5},{"$f":"データリスト!F13&\"委員長、よろしくお願いいたします。\"","v":"A委員長、よろしくお願いいたします。"}]
[{"$nulls":3},{"$f":"データリスト!F13","v":"A"},null,{"$f":"\"　　（\"&データリスト!F13&\"委員長あいさつ）\"","v":"　　（A委員長あいさつ）"}]
[{"$nulls":3},{"$f":"データリスト!I24","v":"佐藤"},null,"有難うございました。"]
[null,{"$f":"\"第\"&データリスト!I6&\"回\"&データリスト!F4&\"分会　\"&データリスト!F21&\"大会議事進行メモ②\"","v":"第59回福島分会　定期大会議事進行メモ②"}]
[null,"８．来賓挨拶",{"$nulls":3},"★　来賓者　なし",{"$nulls":6},"★　来賓者　有り"]
[{"$nulls":5},"祝電　なし",null,null,"祝電　あり",{"$nulls":3},"続きまして、来賓より御挨拶頂きたいと思います。　　　　　　　　　　　　　　　　　　　　　　　　　　　　　　　　○○におかれましては、お忙しい中、我々の分会大会においで頂きありがとうございます。　　　　　それでは、○○をご紹介し挨拶を頂きたいと思います。　　　　　　　　　　　　　　　　　　　　　　　　　　　　　　　　よろしくお願い致します。　　　　　　　　　　　　　　　　　　　　　　　　　　　　　　　　　　　　　　　　　　　　　（○○あいさつ終了・着席後）　　　　　　　　　　　　　　　　　　　　　　　　　　　　　　○○、大変ありがとうございました。"]
[null,"来賓者名簿　＊退席の有無",null,{"$f":"データリスト!I24","v":"佐藤"},null,"次第8番の来賓挨拶ですが、多忙の為来られないとの事なので、次第9番の経過報告に移ります。",null,null,"次第8番の来賓挨拶ですが、多忙の為来られないとの事なので、祝電を頂戴してますので読み上げます。　　　　　　　　　　　　　　　　　　　　　　　　　（祝電代読）　　　　　　　　　　　　　　　　　　　　　次第９番へ移行"]
[null,{"$f":"データリスト!K24","v":"神　本部常任執行役員"}]
[null,{"$f":"データリスト!L24","v":"樋口　本部常任執行役員"}]
[null,{"$f":"データリスト!M24","v":"猪狩　福島支部委員長"}]
[]
[]
[{"$nulls":12},"１名の場合",{"$nulls":3},"２名以上の場合"]
[{"$nulls":12},"本日はお忙しい中、○○においては、おいで頂き大変ありがとうございました。",{"$nulls":3},"続きまして、○○よろしくお願いします。　　　　　　（○○あいさつ終了・着席後）　　　　　　　　　　　　　　　　　　　　　　　○○、大変ありがとうございました。　　　　　　　　　　　　　　　＊繰り返す"]
[]
[]
[]
[]
[]
[{"$nulls":12},"来賓の退席"]
[{"$nulls":12},"なし",null,null,"あり（全員）",null,null,"あり（一部）"]
[{"$nulls":12},"○○に置かれましては、このまま大会に参加して頂きます。",null,null,"それではここで、来賓が退席されますので、感謝の意をこめて拍手でお送りしたいと思います。会場の皆様、宜しくお願いします。　　　　　　　　　　　　　　　　　　　　　（拍手・来賓退席後）　　　　　　　　　　　　　　　　　　　　ありがとうございました。",null,null,"それではここで、来賓が退席されますので、感謝の意をこめて拍手でお送りしたいと思います。会場の皆様、宜しくお願いします。　　　　　　　　　　　　　　　　　　　　　（拍手・来賓退席後）　　　　　　　　　　　　　　　　　　　　ありがとうございました。　　　　　○○に置かれましては、このまま大会に参加して頂きます。　　　"]
{"$rows_empty":10}
[{"$nulls":12},"祝電"]
[{"$nulls":12},"なし",{"$nulls":3},"あり"]
[{"$nulls":12},"次第９番へ移行",{"$nulls":3},"ここで、祝電を頂戴してますので読み上げます。　　　　　　　　　　　　　　　　　　　　　　　　　（祝電代読）　　　　　　　　　　　　　　　　　　　　　　　　　　　　　　　　次第９番へ移行"]
[]
[]
[]
[]
[null,{"$f":"\"第\"&データリスト!I6&\"回\"&データリスト!F4&\"分会　\"&データリスト!F21&\"大会議事進行メモ③\"","v":"第59回福島分会　定期大会議事進行メモ③"}]
[null,"９．経過報告",null,{"$f":"データリスト!I24","v":"佐藤"},null,"それでは、経過報告に入ります。"]
[{"$nulls":5},{"$f":"データリスト!F2&\"年度、分会活動経過報告・会計報告・会計監査報告を、執行部に一括報告して頂きます。\"","v":"2021年度、分会活動経過報告・会計報告・会計監査報告を、執行部に一括報告して頂きます。"}]
[{"$nulls":5},"それでは、執行部お願いします。"]
[{"$nulls":3},{"$f":"データリスト!N24","v":"篤志"},null,"（分会活動経過報告）"]
[{"$nulls":3},{"$f":"データリスト!O24","v":"篤志"},null,"（会計報告）"]
[{"$nulls":3},{"$f":"データリスト!P24","v":"柏原"},null,"（会計監査報告）"]
[]
[null,"10．活動報告に対する質疑討論",null,{"$f":"$D$74","v":"佐藤"},null,"それでは、経過報告に対する審議を行いたいと思います。"]
[{"$nulls":5},{"$f":"データリスト!F2&\"年度、分会活動経過報告・会計報告・会計監査報告について、質問・意見のある方、挙手にてどうぞ。\"","v":"2021年度、分会活動経過報告・会計報告・会計監査報告について、質問・意見のある方、挙手にてどうぞ。"}]
[{"$nulls":3},{"$f":"$D$81","v":"佐藤"},null,"（会場を確認）"]
[]
[{"$nulls":5},"★　挙手している人　なし",{"$nulls":7},"★　挙手している人　あり"]
[{"$nulls":5},"それでは、審議は尽くされたものと判断しますので採決に入ります。",{"$nulls":7},"（挙手している人を指名）"]
[{"$nulls":5},{"$f":"データリスト!F2&\"年度、活動経過報告・会計報告・会計監査報告について\"","v":"2021年度、活動経過報告・会計報告・会計監査報告について"},{"$nulls":7},"ありがとうございました。"]
[{"$nulls":5},"承認される方は挙手願います。",{"$nulls":7},"関連の質問・意見はありませんか？"]
[{"$nulls":5},"（会場の確認）"]
[{"$nulls":5},"ありがとうございました。",{"$nulls":7},"関連　なし",{"$nulls":3},"関連　あり"]
[{"$nulls":5},"賛成多数で承認されました。",{"$nulls":7},"今の質問・意見に対し",{"$nulls":3},"（挙手している人を指名）"]
[{"$nulls":5},"再度の拍手でご確認ください。",{"$nulls":7},"執行部の答弁をお願いします",{"$nulls":3},"ありがとうございました。"]
[{"$nulls":17},"他、関連の質問・意見はありませんか？"]
[{"$nulls":17},"＊繰り返す"]
[{"$nulls":17},"今の質問・意見に対し"]
[{"$nulls":17},"執行部の答弁をお願いします。"]
[]
[{"$nulls":13},"今の答弁で了解頂けましたで\nしょうか？"]
[{"$nulls":13},"（会場の確認）"]
[{"$nulls":13},"今の質問・意見の他にありませんか？"]
[{"$nulls":13},"（会場の確認）"]
[{"$nulls":13},"＊繰り返す"]
[]
[{"$nulls":13},"それでは、審議は尽くされたものと判断しますので採決に入ります。"]
[{"$nulls":13},{"$f":"$F$87","v":"2021年度、活動経過報告・会計報告・会計監査報告について"}]
[{"$nulls":13},"承認される方は挙手願います。　　　　　　"]
[{"$nulls":13},"（会場の確認）"]
[{"$nulls":13},"ありがとうございました。"]
[{"$nulls":13},"賛成多数で承認されました。"]
[{"$nulls":13},"再度の拍手でご確認ください。"]
[]
[null,{"$f":"\"第\"&データリスト!I6&\"回\"&データリスト!F4&\"分会　\"&データリスト!F21&\"大会議事進行メモ④\"","v":"第59回福島分会　定期大会議事進行メモ④"}]
[null,"11．議事",null,{"$f":"$D$83","v":"佐藤"},null,"それではこれより、次第１１番の議事に入ります。"]
[{"$nulls":5},{"$f":"\"第一号議案　　\"&データリスト!F68+1&\"年度活動方針\"","v":"第一号議案　　2022年度活動方針"}]
[{"$nulls":5},{"$f":"\"第二号議案　　\"&データリスト!F68&\"年度収支剰余金処理\"","v":"第二号議案　　2021年度収支剰余金処理"}]
[{"$nulls":5},{"$f":"\"第三号議案　　\"&データリスト!F68+1&\"年度予算\"","v":"第三号議案　　2022年度予算"}]
[{"$nulls":5},"について、執行部より一括して提案願います。"]
[{"$nulls":3},{"$f":"データリスト!Q24","v":"篤志"},null,{"$f":"\"(\"&F114&\")\"","v":"(第一号議案　　2022年度活動方針)"}]
[{"$nulls":3},{"$f":"データリスト!R24","v":"篤志"},null,{"$f":"\"(\"&F115&\")\"","v":"(第二号議案　　2021年度収支剰余金処理)"}]
[{"$nulls":3},{"$f":"データリスト!S24","v":"篤志"},null,"(第三号議案　　2022年度予算)"]
[]
[null,"12．議案に対する質疑応答",null,{"$f":"$D$113","v":"佐藤"},null,"それでは、議案に対する一括審議を行いたいと思います。"]
[{"$nulls":5},"第１号議案から第３号議案について、質問・意見のある方どうぞ。"]
[{"$nulls":5},"（会場を確認）"]
[]
[{"$nulls":5},"★　挙手している人　なし",{"$nulls":7},"★　挙手している人　あり"]
[{"$nulls":5},"それでは、審議は尽くされたものと判断しますので採決に入ります。",{"$nulls":7},"（挙手している人を指名）"]
[{"$nulls":5},"第１号議案から第３号議案について、承認される方は挙手願います。",{"$nulls":7},"ありがとうございました。"]
[{"$nulls":5},"（会場の確認）",{"$nulls":7},"関連の質問・意見はありませんか？"]
[{"$nulls":5},"ありがとうございました。"]
[{"$nulls":5},"賛成多数で承認されました。",{"$nulls":7},"関連　なし",{"$nulls":3},"関連　あり"]
[{"$nulls":5},"再度の拍手でご確認ください。",{"$nulls":7},"今の質問・意見に対し",{"$nulls":3},"（挙手している人を指名）"]
[{"$nulls":13},"執行部の答弁をお願いします",{"$nulls":3},"ありがとうございました。"]
[{"$nulls":17},"他、関連の質問・意見はありませんか？"]
[{"$nulls":17},"＊繰り返す"]
[{"$nulls":17},"今の質問・意見に対し"]
[{"$nulls":17},"執行部の答弁をお願いします。"]
[]
[{"$nulls":13},"今の答弁で了解頂けましたで\nしょうか？"]
[{"$nulls":13},"（会場の確認）"]
[{"$nulls":13},"今の質問・意見の他にありませんか？"]
[{"$nulls":13},"（会場の確認）"]
[{"$nulls":13},"＊繰り返す"]
[]
[{"$nulls":13},"それでは、審議は尽くされたものと判断しますので採決に入ります。"]
[{"$nulls":13},"第１号議案から第３号議案について、承認される方は挙手願います。"]
[{"$nulls":13},"（会場の確認）"]
[{"$nulls":13},"ありがとうございました。"]
[{"$nulls":13},"賛成多数で承認されました。"]
[{"$nulls":13},"再度の拍手でご確認ください。"]
[]
[null,{"$f":"\"第\"&データリスト!I6&\"回\"&データリスト!F4&\"分会　\"&データリスト!F21&\"大会議事進行メモ⑤\"","v":"第59回福島分会　定期大会議事進行メモ⑤"}]
[null,"13．役員選出",null,{"$f":"$D$122","v":"佐藤"},null,{"$f":"\"続きまして、第４号議案\"&データリスト!F2+1&\"年度役員選出に入ります。\"","v":"続きまして、第４号議案2022年度役員選出に入ります。"}]
[{"$nulls":5},{"$f":"\"分会役員については、\"&データリスト!I9&\"告示を行い、\"&データリスト!J9&\"立候補者を締切、\"&データリスト!K9&\"公示を行った結果、記載の方々が無投票当選いたしました。\"","v":"分会役員については、2021年8月6日告示を行い、2021年8月16日立候補者を締切、2021年8月19日公示を行った結果、記載の方々が無投票当選いたしました。"}]
[{"$nulls":5},"全員の拍手で確認をお願いいたします。"]
[{"$nulls":3},"会場",null,"（拍手）"]
[{"$nulls":3},{"$f":"$D$153","v":"佐藤"},null,"続きまして、新役員を紹介しますので、呼ばれましたら演壇の前に整列してください。"]
[{"$nulls":5},{"$f":"分会大会議案書!AL69&\"　　\"&分会大会議案書!AQ69&\"　　\"&分会大会議案書!AT69","v":"　　分会執行委員長　　あ　　ア"}]
[{"$nulls":5},{"$f":"分会大会議案書!AL71&\"　　\"&分会大会議案書!AQ71&\"　　\"&分会大会議案書!AT71","v":"　　分会執行副委員長　　い　　イ"}]
[{"$nulls":5},{"$f":"分会大会議案書!AL73&\"　　\"&分会大会議案書!AQ73&\"　　\"&分会大会議案書!AT73","v":"　　分会書記長　　う　　ウ"}]
[{"$nulls":5},{"$f":"分会大会議案書!AL75&\"　　\"&分会大会議案書!AQ75&\"　　\"&分会大会議案書!AT75","v":"　　分会執行委員　　え　　エ"}]
[{"$nulls":5},{"$f":"分会大会議案書!AL77&\"　　\"&分会大会議案書!AQ77&\"　　\"&分会大会議案書!AT77","v":"　　分会執行委員　　お　　オ"}]
[{"$nulls":5},{"$f":"分会大会議案書!AL79&\"　　\"&分会大会議案書!AQ79&\"　　\"&分会大会議案書!AT79","v":"　　分会会計監査員　　か　　カ"}]
[]
[null,"14．新旧役員挨拶",null,{"$f":"$D$157","v":"佐藤"},null,{"$f":"\"それでは新役員を代表し\"&データリスト!F12&\"委員長より挨拶を頂きます。\"","v":"それでは新役員を代表しあ委員長より挨拶を頂きます。"}]
[{"$nulls":5},{"$f":"データリスト!F12&\"委員長よろしくお願いします。\"","v":"あ委員長よろしくお願いします。"}]
[{"$nulls":3},{"$f":"データリスト!F12","v":"あ"},null,"（委員長挨拶）"]
[{"$nulls":3},{"$f":"$D$165","v":"佐藤"},null,"ありがとうございました｡"]
[{"$nulls":5},"自席へお戻りください。"]
[{"$nulls":5},"（役員着席後）"]
[]
[null,"15．議長団解任",null,{"$f":"$D$168","v":"佐藤"},null,"（起立）"]
[{"$nulls":5},"以上をもちまして、用意された議事については、全て終了しました。"]
[{"$nulls":5},"これで大会書記を解任とさせていただきます。"]
[{"$nulls":3},{"$f":"データリスト!J24","v":"元内"},null,"（その場で起立・一礼）"]
[{"$nulls":3},{"$f":"$D$172","v":"佐藤"},null,"大会議長を解任に移ります。スムーズな議事進行へのご協力ありがとうございました。"]
[{"$nulls":5},"（一礼・自席へ着席）"]
[]
[null,"16．閉会の挨拶",null,{"$f":"データリスト!F24","v":"花見"},null,{"$f":"データリスト!I24&\"さん、\"&データリスト!J24&\"さん、ありがとうございました。\"","v":"佐藤さん、元内さん、ありがとうございました。"}]
[{"$nulls":5},"大会議長ならびに大会書記に対して全員の拍手で、その労をねぎらいたいと思います。"]
[{"$nulls":5},"皆さん宜しくお願いします。"]
[{"$nulls":3},"会場",null,"（拍手）"]
[{"$nulls":3},{"$f":"$D$179","v":"花見"},null,"ありがとうございました。"]
[{"$nulls":5},{"$f":"\"長時間に渡り大変お疲れ様でした。これを持ちまして、\"&\"第\"&データリスト!I6&\"回\"&データリスト!F4&\"分会\"&データリスト!F21&\"大会を閉会いたします。\"","v":"長時間に渡り大変お疲れ様でした。これを持ちまして、第59回福島分会定期大会を閉会いたします。"}]
[]
[null,"＊その他連絡事項",null,{"$f":"$D$183","v":"花見"},null,"今後の日程につきまして、執行部より事務連絡があればお願いします。"]
[{"$nulls":3},{"$f":"データリスト!F12","v":"あ"},null,"（連絡事項があれば伝達）"]
[{"$nulls":3},{"$f":"$D$187","v":"あ"},null,"以上で、本日の日程は終了です。"]
[{"$nulls":5},"長い間、大変お疲れさまでした。"]
[{"$nulls":5},"（解散）"]