{"text_format":"3","workbook":"xlsx","n_sheets":8,"sheets":["データリスト","役員の割り振り","年度の予定・記録","2ヶ月カレンダー (2)","Sheet1","分会定期大会開催案内書　兼　委任状","分会大会議案書","議長議事進行メモ"],"not_rendered":{"images":2,"macros":1,"defined_names":59},"read":"whole","date_system":"1900"}

{"sheet":"データリスト","index":0,"n_rows":70,"n_cols":40,"rows_kept":70,"merged":[[1,0,1,1],[1,5,1,6],[3,0,3,4],[3,5,3,6],[5,0,5,1],[5,5,5,6],[7,0,8,1],[10,0,12,0],[16,0,16,4],[18,0,18,1],[18,5,18,6],[18,8,18,10],[20,0,20,1],[20,5,20,6],[22,0,23,1],[22,10,22,12],[25,0,25,1],[25,5,25,6],[25,8,25,10],[27,0,27,1],[27,5,27,6],[29,0,29,1],[29,5,29,6],[29,8,29,10],[32,0,32,1],[33,0,33,1],[35,0,35,1],[37,0,37,1],[37,5,37,15],[39,0,42,1],[39,5,39,6],[39,7,39,8],[39,9,39,10],[39,11,39,12],[39,13,39,14],[39,15,39,16],[40,5,42,6],[40,7,42,8],[40,9,42,10],[40,11,42,12],[40,13,42,14],[40,15,42,16],[44,0,65,4],[44,5,44,14],[67,0,67,4],[69,0,69,4]]}
[]
["活動年度",{"$nulls":4},"2021"]
[]
["活動分会名　＆　組合員人数",{"$nulls":4},"福島",null,"＆","37"]
[]
["2021年9月の大会回数",{"$nulls":4},"58",null,{"$f":"F2-2020","v":1},{"$f":"F6+H6","v":59}]
[]
[{"$f":"F2+1&\"年度新役員選挙\"","v":"2022年度新役員選挙"},{"$nulls":4},"告示日","締切日","公示日"]
{"$rows_left_out":63}
{"sheet":"役員の割り振り","index":1,"n_rows":734,"n_cols":26,"rows_kept":734,"merged":[[5,1,6,7],[5,8,6,13]]}
[]
[{"$nulls":3},"業務比率"]
[{"$nulls":3},{"$f":"IF(データリスト!F13=\"\",\"\",データリスト!F15)","v":"A"},{"$f":"IF(データリスト!G13=\"\",\"\",データリスト!G15)","v":"B"},{"$f":"IF(データリスト!H13=\"\",\"\",データリスト!H15)","v":"C"},{"$f":"IF(データリスト!I13=\"\",\"\",データリスト!I15)","v":"D"},{"$f":"IF(データリスト!J13=\"\",\"\",データリスト!J15)","v":"E"},{"$f":"IF(データリスト!K13=\"\",\"\",データリスト!K15)","v":"F"},{"$f":"IF(データリスト!L13=\"\",\"\",データリスト!L15)","v":"G"},{"$f":"IF(データリスト!M13=\"\",\"\",データリスト!M15)","v":"H"},{"$f":"IF(データリスト!N13=\"\",\"\",データリスト!N15)","v":""},{"$f":"IF(データリスト!O13=\"\",\"\",データリスト!O15)","v":""}]
[{"$nulls":3},{"$f":"T8","v":{"v":0,"d":"0.0%"}},{"$f":"T9","v":{"v":0,"d":"0.0%"}},{"$f":"T10","v":{"v":0,"d":"0.0%"}},{"$f":"T11","v":{"v":0,"d":"0.0%"}},{"$f":"T12","v":{"v":0,"d":"0.0%"}},{"$f":"T13","v":{"v":0,"d":"0.0%"}},{"$f":"T14","v":{"v":0,"d":"0.0%"}},{"$f":"T15","v":{"v":0,"d":"0.0%"}},{"$f":"T16","v":{"v":0,"d":"0.0%"}},{"$f":"T17","v":{"v":0,"d":"0.0%"}}]
[]
[null,"活動内容",{"$nulls":6},"担当者選択",{"$nulls":8},{"$f":"700-COUNTIF(C9:C708,\"\")","v":200}]
[]
[{"$nulls":8},"メイン","サブ１","サブ２","サブ３","サブ４","サブ５",{"$nulls":3},{"$f":"IF(データリスト!F15=\"\",0,COUNTIF($I$9:$N$708,データリスト!F15))","v":0},{"$f":"データリスト!F15","v":"A"},{"$f":"R8/R6","v":{"v":0,"d":"0.000%"}}]
{"$rows_left_out":727}
{"sheet":"年度の予定・記録","index":2,"n_rows":64,"n_cols":56,"rows_kept":64,"merged":[[7,7,7,9],[7,10,7,11],[7,12,7,21],[7,23,7,24],[8,10,8,11],[8,12,8,21]]}
[{"$nulls":49},"科目","総務費","活動調査費","組織活動費","大会費","予備費","合計"]
[{"$nulls":49},"予算",{"$f":"データリスト!F33","v":{"v":37400,"d":"¥37,400"}},{"$f":"データリスト!G33","v":{"v":135000,"d":"¥135,000"}},{"$f":"データリスト!H33","v":{"v":198100,"d":"¥198,100"}},{"$f":"データリスト!I33","v":{"v":16100,"d":"¥16,100"}},{"$f":"データリスト!J33","v":{"v":13618,"d":"¥13,618"}},{"$f":"SUM(AY2:BC2)","v":{"v":400218,"d":"¥400,218"}}]
[{"$nulls":49},"支出額",{"$f":"SUMIF(W9:Y64,AY1,AP9:AP64)","v":0},{"$f":"SUMIF(W9:Y64,AZ1,AP9:AP64)","v":{"v":120000,"d":"¥120,000"}},{"$f":"SUMIF(W9:Y64,BA1,AP9:AP64)","v":{"v":146766,"d":"¥146,766"}},{"$f":"SUMIF(W9:Y64,BB1,AP9:AP64)","v":{"v":12340,"d":"¥12,340"}},{"$f":"SUMIF(W9:Y64,BC1,AP9:AP64)","v":0},{"$f":"SUM(AY3:BC3)","v":{"v":279106,"d":"¥279,106"}}]
[{"$nulls":49},"報告支出額",{"$f":"IF(AY3>AY2,AY2,AY3)","v":0},{"$f":"IF(AZ3>AZ2,AZ2,AZ3)","v":{"v":120000,"d":"¥120,000"}},{"v":146766,"d":"¥146,766"},{"v":12340,"d":"¥12,340"},{"$f":"BC3+BD6","v":0},{"v":279106,"d":"¥279,106"}]
[{"$nulls":49},"収入額",{"$f":"SUMIF(W9:Y64,AY1,AP9:AP64)","v":0},{"$f":"SUMIF(W9:Y64,AZ1,AP9:AP64)","v":{"v":120000,"d":"¥120,000"}},{"$f":"SUMIF(W9:Y64,BA1,AP9:AP64)","v":{"v":146766,"d":"¥146,766"}},{"$f":"SUMIF(W9:Y64,BB1,AP9:AP64)","v":{"v":12340,"d":"¥12,340"}},{"$f":"SUMIF(W9:Y64,BC1,AP9:AP64)","v":0},{"$f":"SUM(AY5:BC5)","v":{"v":279106,"d":"¥279,106"}}]
[{"$nulls":49},"予算超過分",{"$f":"IF(AY3-AY2<0,0,AY3-AY2)","v":0},{"$f":"IF(AZ3-AZ2<0,0,AZ3-AZ2)","v":0},{"$f":"IF(BA3-BA2<0,0,BA3-BA2)","v":0},{"$f":"IF(BB3-BB2<0,0,BB3-BB2)","v":0},{"$f":"IF(BC3-BC2<0,0,BC3-BC2)","v":0},{"$f":"SUM(AY6:BC6)","v":0}]
[{"$nulls":49},"使用率",{"$f":"AY3/AY2","v":{"v":0,"d":"0.0%"}},{"$f":"AZ3/AZ2","v":{"v":0.8888888888888888,"d":"88.9%"}},{"v":0.7408682483594144,"d":"74.1%"},{"$f":"BB3/BB2","v":{"v":0.7664596273291926,"d":"76.6%"}},{"$f":"BC3/BC2","v":{"v":0,"d":"0.0%"}},{"v":0.6973849252157575,"d":"69.7%"}]
[{"$nulls":3},{"$f":"MAX(F9:F64)","v":8},{"$nulls":3},"活動日",null,null,"活動内容",null,"対応者",{"$nulls":9},"出費・収入項目","金額",null,"備考(支出理由等）"]
{"$rows_left_out":57}
{"sheet":"2ヶ月カレンダー (2)","index":3,"n_rows":53,"n_cols":81,"rows_kept":53,"merged":[[1,7,1,8],[1,9,1,10],[1,11,2,21],[2,7,2,8],[2,9,2,10],[4,7,4,8],[4,9,4,10],[4,11,4,17],[4,18,4,23],[4,37,4,42],[4,43,4,48],[4,49,4,60],[4,61,4,66],[5,7,5,8],[5,9,5,10],[5,12,5,17],[5,18,5,23],[5,24,5,29],[5,30,5,35],[5,37,5,42],[5,43,5,48],[5,49,5,54],[5,55,5,60],[5,61,5,66],[5,67,5,72],[5,73,5,78],[6,7,6,8],[6,9,6,10],[6,12,6,17],[6,18,6,23],[6,24,6,29],[6,30,6,35],[6,37,6,42],[6,43,6,48],[6,49,6,54],[6,55,6,60],[6,61,6,66],[6,67,6,72],[6,73,6,78],[7,7,7,8],[7,9,7,10],[7,12,7,17],[7,18,7,23],[7,24,7,29],[7,30,7,35],[7,37,7,42],[7,43,7,48],[7,49,7,54],[7,55,7,60],[7,61,7,66],[7,67,7,72],[7,73,7,78],[8,7,8,8],[8,9,8,10],[8,12,8,17],[8,18,8,23],[8,24,8,29],[8,30,8,35],[8,37,8,42],[8,43,8,48],[8,49,8,54],[8,55,8,60],[8,61,8,66],[8,67,8,72],[8,73,8,78],[9,7,9,8],[9,9,9,10],[9,12,9,17],[9,18,9,23],[9,24,9,29],[9,30,9,35],[9,37,9,42],[9,43,9,48],[9,49,9,54],[9,55,9,60],[9,61,9,66],[9,67,9,72],[9,73,9,78],[10,7,10,8],[10,9,10,10],[10,12,10,17],[10,18,10,23],[10,24,10,29],[10,30,10,35],[10,37,10,42],[10,43,10,48],[10,49,10,54],[10,55,10,60],[10,61,10,66],[10,67,10,72],[10,73,10,78],[11,7,11,8],[11,9,11,10],[11,12,11,17],[11,18,11,23],[11,24,11,29],[11,30,11,35],[11,37,11,42],[11,43,11,48],[11,49,11,54],[11,55,11,60],[11,61,11,66],[11,67,11,72],[11,73,11,78],[12,7,12,8],[12,9,12,10],[12,12,12,17],[12,18,12,23],[12,24,12,29],[12,30,12,35],[12,37,12,42],[12,43,12,48],[12,49,12,54],[12,55,12,60],[12,61,12,66],[12,67,12,72],[12,73,12,78],[13,7,13,8],[13,9,13,10],[13,12,13,17],[13,18,13,23],[13,24,13,29],[13,30,13,35],[13,37,13,42],[13,43,13,48],[13,49,13,54],[13,55,13,60],[13,61,13,66],[13,67,13,72],[13,73,13,78],[14,7,14,8],[14,9,14,10],[14,12,14,17],[14,18,14,23],[14,24,14,29],[14,30,14,35],[14,37,14,42],[14,43,14,48],[14,49,14,54],[14,55,14,60],[14,61,14,66],[14,67,14,72],[14,73,14,78],[15,7,15,8],[15,9,15,10],[15,12,15,17],[15,18,15,23],[15,24,15,29],[15,30,15,35],[15,37,15,42],[15,43,15,48],[15,49,15,54],[15,55,15,60],[15,61,15,66],[15,67,15,72],[15,73,15,78],[16,7,16,8],[16,9,16,10],[16,12,16,17],[16,18,16,23],[16,24,16,29],[16,30,16,35],[16,37,16,42],[16,43,16,48],[16,49,16,54],[16,55,16,60],[16,61,16,66],[16,67,16,72],[16,73,16,78],[17,7,17,8],[17,9,17,10],[17,12,17,17],[17,18,17,23],[17,24,17,29],[17,30,17,35],[17,37,17,42],[17,43,17,48],[17,49,17,54],[17,55,17,60],[17,61,17,66],[17,67,17,72],[17,73,17,78],[19,7,20,10],[19,11,20,16],[19,17,19,47],[19,48,19,78],[21,7,21,10],[21,11,21,16],[22,7,22,10],[22,11,22,16],[23,7,23,10],[23,11,23,16],[24,7,24,10],[24,11,24,16],[25,7,25,10],[25,11,25,16],[26,7,26,10],[26,11,26,16],[27,7,27,10],[27,11,27,16],[28,7,28,10],[28,11,28,16],[29,7,29,10],[29,11,29,16],[30,7,30,10],[30,11,30,16],[31,7,31,10],[31,11,31,16],[32,7,32,10],[32,11,32,16],[33,7,33,10],[33,11,33,16],[34,7,34,10],[34,11,34,16],[35,7,35,10],[35,11,35,16],[36,7,36,10],[36,11,36,16],[37,7,37,10],[37,11,37,16],[38,7,38,10],[38,11,38,16],[39,7,39,10],[39,11,39,16],[40,7,40,10],[40,11,40,16],[41,7,41,10],[41,11,41,16],[42,7,42,10],[42,11,42,16],[43,7,43,10],[43,11,43,16],[44,7,44,10],[44,11,44,16],[45,7,45,10],[45,11,45,16],[46,7,46,10],[46,11,46,16],[47,7,47,10],[47,11,47,16],[48,7,48,10],[48,11,48,16],[49,7,49,10],[49,11,49,16],[50,7,50,10],[50,11,50,16],[51,7,51,10],[51,11,51,16],[52,7,52,10],[52,11,52,16]]}
[{"$nulls":7},{"$f":"H3","v":9},{"$f":"J3","v":10}]
[{"$nulls":7},2021,null,2021,null,"←表示したい年月を入力"]
[{"$nulls":7},9,null,10]
[]
[{"$nulls":7},{"$f":"H2","v":2021},null,{"$f":"H3","v":9},null,{"$f":"DATE(H5,J5,1)","v":"2021-09-01"},{"$nulls":6},{"$f":"WEEKDAY(L5,1)","v":4},{"$nulls":18},{"$f":"J2","v":2021},{"$nulls":5},{"$f":"J3","v":10},{"$nulls":5},{"$f":"DATE(AL5,AR5,1)","v":"2021-10-01"},{"$nulls":11},{"$f":"WEEKDAY(AX5,1)","v":6}]
[{"$nulls":7},"日",null,"月",null,"火","水",{"$nulls":5},"木",{"$nulls":5},"金",{"$nulls":5},"土",{"$nulls":6},"日",{"$nulls":5},"月",{"$nulls":5},"火",{"$nulls":5},"水",{"$nulls":5},"木",{"$nulls":5},"金",{"$nulls":5},"土"]
[{"$nulls":7},{"$f":"L5-(S5-1)","v":"2021-08-29"},null,{"$f":"H7+1","v":"2021-08-30"},null,{"$f":"J7+1","v":"2021-08-31"},{"$f":"L7+1","v":"2021-09-01"},{"$nulls":5},{"$f":"M7+1","v":"2021-09-02"},{"$nulls":5},{"$f":"S7+1","v":"2021-09-03"},{"$nulls":5},{"$f":"Y7+1","v":"2021-09-04"},{"$nulls":6},{"$f":"AX5-(BJ5-1)","v":"2021-09-26"},{"$nulls":5},{"$f":"AL7+1","v":"2021-09-27"},{"$nulls":5},{"$f":"AR7+1","v":"2021-09-28"},{"$nulls":5},{"$f":"AX7+1","v":"2021-09-29"},{"$nulls":5},{"$f":"BD7+1","v":"2021-09-30"},{"$nulls":5},{"$f":"BJ7+1","v":"2021-10-01"},{"$nulls":5},{"$f":"BP7+1","v":"2021-10-02"}]
[{"$nulls":7},{"$f":"IFERROR(VLOOKUP(H7,年度の予定・記録!$H:$AN,31,FALSE),\"\")","v":""},null,{"$f":"IFERROR(VLOOKUP(J7,年度の予定・記録!$H:$AN,31,FALSE),\"\")","v":""},null,{"$f":"IFERROR(VLOOKUP(L7,年度の予定・記録!$H:$AN,31,FALSE),\"\")","v":""},{"$f":"IFERROR(VLOOKUP(M7,年度の予定・記録!$H:$AN,31,FALSE),\"\")","v":""},{"$nulls":5},{"$f":"IFERROR(VLOOKUP(S7,年度の予定・記録!$H:$AN,31,FALSE),\"\")","v":""},{"$nulls":5},{"$f":"IFERROR(VLOOKUP(Y7,年度の予定・記録!$H:$AN,31,FALSE),\"\")","v":""},{"$nulls":5},{"$f":"IFERROR(VLOOKUP(AE7,年度の予定・記録!$H:$AN,31,FALSE),\"\")","v":""},{"$nulls":6},{"$f":"IFERROR(VLOOKUP(AL7,年度の予定・記録!$H:$AN,31,FALSE),\"\")","v":""},{"$nulls":5},{"$f":"IFERROR(VLOOKUP(AR7,年度の予定・記録!$H:$AN,31,FALSE),\"\")","v":""},{"$nulls":5},{"$f":"IFERROR(VLOOKUP(AX7,年度の予定・記録!$H:$AN,31,FALSE),\"\")","v":""},{"$nulls":5},{"$f":"IFERROR(VLOOKUP(BD7,年度の予定・記録!$H:$AN,31,FALSE),\"\")","v":""},{"$nulls":5},{"$f":"IFERROR(VLOOKUP(BJ7,年度の予定・記録!$H:$AN,31,FALSE),\"\")","v":""},{"$nulls":5},{"$f":"IFERROR(VLOOKUP(BP7,年度の予定・記録!$H:$AN,31,FALSE),\"\")","v":""},{"$nulls":5},{"$f":"IFERROR(VLOOKUP(BV7,年度の予定・記録!$H:$AN,31,FALSE),\"\")","v":""}]
{"$rows_left_out":46}
{"sheet":"Sheet1","index":4,"n_rows":8,"n_cols":8,"rows_kept":8}
[]
[null,{"$f":"年度の予定・記録!AX1","v":"科目"},{"$f":"年度の予定・記録!AY1","v":"総務費"},{"$f":"年度の予定・記録!AZ1","v":"活動調査費"},{"$f":"年度の予定・記録!BA1","v":"組織活動費"},{"$f":"年度の予定・記録!BB1","v":"大会費"},{"$f":"年度の予定・記録!BC1","v":"予備費"},{"$f":"年度の予定・記録!BD1","v":"合計"}]
[null,"内訳例","・コピー用紙・文具・事務用品など　　　　　　　　　　　　　　　　　　　　　　　・電報・郵便・郵送代\n・弔電・香典等の慶弔対応費用　　　　　　　　　　　　　　　　　　　　　　　　　　　　　　　　　　　　　　　　　　　　　　　　　　　　　　　　　　　　　　　　　　　　　　　　　・その他り込み手数料等の事務費","・分会執行役員の活動調査費　　　　　　　　　　　　　　　　　　　　　　　　　　　　　　　　　　　　・活動に必要な新聞・書本・雑誌購入代金","【総務費】、【活動費】、【大会費】以外                           全ての活動経費　　　　　　　　　　","・分会大会の開催に掛かるすべての経費                      (会場借用費、飲食代等）\n・大会後の懇親会等については、組織活動費として計上すること。","・前年度繰越金、銀行利息等　　　　　　　　　　　　　　　　　　・各科目毎に予算を超えてしまった部分の充当　　　　　　　　　　　　　　　　　　　　　　　　　　"]
[null,{"$f":"年度の予定・記録!AX2","v":"予算"},{"$f":"年度の予定・記録!AY2","v":{"v":37400,"d":"¥37,400"}},{"$f":"年度の予定・記録!AZ2","v":{"v":135000,"d":"¥135,000"}},{"$f":"年度の予定・記録!BA2","v":{"v":198100,"d":"¥198,100"}},{"$f":"年度の予定・記録!BB2","v":{"v":16100,"d":"¥16,100"}},{"$f":"年度の予定・記録!BC2","v":{"v":13618,"d":"¥13,618"}},{"$f":"年度の予定・記録!BD2","v":{"v":400218,"d":"¥400,218"}}]
[null,{"$f":"年度の予定・記録!AX3","v":"支出額"},{"$f":"年度の予定・記録!AY3","v":{"v":0,"d":"¥0"}},{"$f":"年度の予定・記録!AZ3","v":{"v":120000,"d":"¥120,000"}},{"$f":"年度の予定・記録!BA3","v":{"v":146766,"d":"¥146,766"}},{"$f":"年度の予定・記録!BB3","v":{"v":12340,"d":"¥12,340"}},{"$f":"年度の予定・記録!BC3","v":{"v":0,"d":"¥0"}},{"$f":"年度の予定・記録!BD3","v":{"v":279106,"d":"¥279,106"}}]
[null,{"$f":"年度の予定・記録!AX5","v":"収入額"},{"$f":"年度の予定・記録!AY5","v":{"v":0,"d":"¥0"}},{"$f":"年度の予定・記録!AZ5","v":{"v":120000,"d":"¥120,000"}},{"$f":"年度の予定・記録!BA5","v":{"v":146766,"d":"¥146,766"}},{"$f":"年度の予定・記録!BB5","v":{"v":12340,"d":"¥12,340"}},{"$f":"年度の予定・記録!BC5","v":{"v":0,"d":"¥0"}},{"$f":"年度の予定・記録!BD5","v":{"v":279106,"d":"¥279,106"}}]
[null,{"$f":"年度の予定・記録!AX6","v":"予算超過分"},{"$f":"年度の予定・記録!AY6","v":{"v":0,"d":"¥0"}},{"$f":"年度の予定・記録!AZ6","v":{"v":0,"d":"¥0"}},{"$f":"年度の予定・記録!BA6","v":{"v":0,"d":"¥0"}},{"$f":"年度の予定・記録!BB6","v":{"v":0,"d":"¥0"}},{"$f":"年度の予定・記録!BC6","v":{"v":0,"d":"¥0"}},{"$f":"年度の予定・記録!BD6","v":{"v":0,"d":"¥0"}}]
[null,{"$f":"年度の予定・記録!AX7","v":"使用率"},{"$f":"年度の予定・記録!AY7","v":{"v":0,"d":"0.0%"}},{"$f":"年度の予定・記録!AZ7","v":{"v":0.8888888888888888,"d":"88.9%"}},{"$f":"年度の予定・記録!BA7","v":{"v":0.7408682483594144,"d":"74.1%"}},{"$f":"年度の予定・記録!BB7","v":{"v":0.7664596273291926,"d":"76.6%"}},{"$f":"年度の予定・記録!BC7","v":{"v":0,"d":"0.0%"}},{"$f":"年度の予定・記録!BD7","v":{"v":0.6973849252157575,"d":"69.7%"}}]
{"$rows_left_out":1}
{"sheet":"分会定期大会開催案内書　兼　委任状","index":5,"n_rows":38,"n_cols":6,"rows_kept":38,"merged":[[2,1,2,9],[3,1,3,9],[4,1,4,9],[5,1,5,9],[7,1,8,9],[10,1,10,9],[11,1,11,9],[12,1,12,9],[13,1,13,9],[14,1,14,9],[15,1,15,9],[17,1,17,9],[19,1,19,3],[19,4,19,9],[20,1,20,3],[20,4,20,9],[21,1,21,3],[21,4,21,9],[24,1,25,9],[27,1,28,9],[30,1,31,9],[32,1,33,9],[35,5,36,8],[37,5,38,8]]}
[]
[]
[null,{"$f":"TODAY()","v":"2022-08-30"}]
[null,{"$f":"データリスト!F4&\"分会組合員　様\"","v":"福島分会組合員　様"}]
[null,{"$f":"\"ユアテックユニオン\"&データリスト!F4&\"分会\"","v":"ユアテックユニオン福島分会"}]
[null,{"$f":"\"執行委員長     \"&データリスト!F13","v":"執行委員長     A"}]
[]
[null,{"$f":"\"第\"&データリスト!I6&\"回\"&データリスト!F4&\"分会\"&データリスト!F21&\"大会の開催について（出席要請）\"","v":"第59回福島分会定期大会の開催について（出席要請）"}]
{"$rows_left_out":31}
{"sheet":"分会大会議案書","index":6,"n_rows":86,"n_cols":58,"rows_kept":86,"merged":[[3,11,4,17],[3,21,5,34],[3,38,5,46],[3,50,5,56],[4,1,9,8],[6,20,10,35],[6,42,6,45],[7,38,8,39],[7,42,8,46],[8,49,22,57],[9,38,10,39],[9,42,10,46],[11,19,11,21],[11,22,11,27],[11,28,11,30],[11,31,11,36],[11,37,12,42],[11,43,12,48],[12,19,12,21],[12,22,12,27],[12,28,12,30],[12,31,12,36],[13,19,13,21],[13,22,13,27],[13,28,13,30],[13,31,13,36],[13,37,14,38],[13,39,14,40],[13,41,14,42],[13,43,14,44],[13,45,14,46],[13,47,14,48],[14,19,14,21],[14,22,14,27],[14,28,14,30],[14,31,14,36],[15,2,20,7],[15,19,15,21],[15,22,15,27],[15,28,15,30],[15,31,15,36],[15,37,16,38],[15,39,16,40],[15,41,16,42],[15,43,16,44],[15,45,16,46],[15,47,16,48],[16,19,16,21],[16,22,16,27],[16,28,16,30],[16,31,16,36],[17,19,17,21],[17,22,17,27],[17,28,17,30],[17,31,17,36],[17,37,18,38],[17,39,18,40],[17,41,18,42],[17,43,18,44],[17,45,18,46],[17,47,18,48],[18,19,18,21],[18,22,18,27],[18,28,18,30],[18,31,18,36],[19,19,19,21],[19,22,19,27],[19,28,19,30],[19,31,19,36],[19,37,20,38],[19,39,20,40],[19,41,20,42],[19,43,20,44],[19,45,20,46],[19,47,20,48],[20,19,20,21],[20,22,20,27],[20,28,20,30],[20,31,20,36],[21,19,21,21],[21,22,21,27],[21,28,21,30],[21,31,21,36],[21,37,22,38],[21,39,22,40],[21,41,22,42],[21,43,22,44],[21,45,22,46],[21,47,22,48],[22,19,22,21],[22,22,22,27],[22,28,22,30],[22,31,22,36],[23,19,23,21],[23,22,23,27],[23,28,23,30],[23,31,23,36],[23,37,24,38],[23,39,24,40],[23,41,24,42],[23,43,24,44],[23,45,24,46],[23,47,24,48],[24,19,24,21],[24,22,24,27],[24,28,24,30],[24,31,24,36],[25,19,25,21],[25,22,25,27],[25,28,25,30],[25,31,25,36],[25,37,26,38],[25,39,26,40],[25,41,26,42],[25,43,26,44],[25,45,26,46],[25,47,26,48],[26,19,26,21],[26,22,26,27],[26,28,26,30],[26,31,26,36],[27,19,27,21],[27,22,27,27],[27,28,27,30],[27,31,27,36],[27,37,28,38],[27,39,28,40],[27,41,28,42],[27,43,28,44],[27,45,28,46],[27,47,28,48],[28,19,28,21],[28,22,28,27],[28,28,28,30],[28,31,28,36],[29,19,29,21],[29,22,29,27],[29,28,29,30],[29,31,29,36],[29,37,30,38],[29,39,30,40],[29,41,30,42],[29,43,30,44],[29,45,30,46],[29,47,30,48],[29,52,30,57],[30,19,30,21],[30,22,30,27],[30,28,30,30],[30,31,30,36],[31,19,31,21],[31,22,31,27],[31,28,31,30],[31,31,31,36],[31,37,32,38],[31,39,32,40],[31,41,32,42],[31,43,32,44],[31,45,32,46],[31,47,32,48],[32,19,32,21],[32,22,32,27],[32,28,32,30],[32,31,32,36],[32,49,33,57],[33,2,34,9],[33,19,33,21],[33,22,33,27],[33,28,33,30],[33,31,33,36],[34,19,34,21],[34,22,34,27],[34,28,34,30],[34,31,34,36],[34,37,34,48],[34,49,35,57],[35,0,36,9],[35,19,35,21],[35,22,35,27],[35,28,35,30],[35,31,35,36],[36,19,36,21],[36,22,36,27],[36,28,36,30],[36,31,36,36],[36,37,36,48],[37,4,38,7],[37,19,37,21],[37,22,37,27],[37,28,37,30],[37,31,37,36],[37,37,37,48],[37,52,38,57],[38,19,38,21],[38,22,38,27],[38,28,38,30],[38,31,38,36],[39,0,40,9],[39,19,39,21],[39,22,39,27],[39,28,39,30],[39,31,39,36],[39,37,39,48],[39,52,40,56],[39,57,40,57],[40,19,40,21],[40,22,40,27],[40,28,40,30],[40,31,40,36],[41,19,41,21],[41,22,41,27],[41,28,41,30],[41,31,41,36],[42,19,42,21],[42,22,42,27],[42,28,42,30],[42,31,42,36],[43,37,44,48],[44,0,45,9],[44,19,45,36],[45,37,47,48],[46,1,48,8],[46,11,48,17],[46,21,48,34],[46,50,48,56],[49,1,50,8],[49,20,50,28],[49,29,50,33],[49,34,50,35],[49,37,50,41],[49,42,50,44],[49,45,50,48],[50,11,51,17],[51,20,52,35],[51,37,52,41],[51,42,52,44],[51,45,52,48],[51,50,52,56],[52,0,68,9],[52,11,55,17],[53,37,54,41],[53,42,54,44],[53,45,54,48],[54,19,55,36],[55,37,56,41],[55,42,56,44],[55,45,56,48],[55,50,56,56],[56,11,57,17],[56,21,58,34],[57,37,58,41],[57,42,58,44],[57,45,58,48],[58,11,61,17],[59,37,60,41],[59,42,60,44],[59,45,60,48],[59,50,60,56],[60,19,63,27],[60,28,63,36],[62,11,63,17],[63,50,64,56],[64,11,67,17],[64,19,66,22],[64,23,66,27],[64,28,66,31],[64,32,66,36],[64,37,66,48],[67,19,69,22],[67,23,69,27],[67,28,69,31],[67,32,69,36],[67,50,68,56],[68,11,69,17],[68,37,69,41],[68,42,69,44],[68,45,69,48],[70,0,72,9],[70,11,73,17],[70,19,72,22],[70,23,72,27],[70,28,72,31],[70,32,72,36],[70,37,71,41],[70,42,71,44],[70,45,71,48],[72,37,73,41],[72,42,73,44],[72,45,73,48],[73,19,75,22],[73,23,75,27],[73,28,75,31],[73,32,75,36],[74,0,76,9],[74,11,75,17],[74,37,75,41],[74,42,75,44],[74,45,75,48],[76,11,79,17],[76,19,78,22],[76,23,78,27],[76,28,78,31],[76,32,78,36],[76,37,77,41],[76,42,77,44],[76,45,77,48],[78,0,80,9],[78,37,79,41],[78,42,79,44],[78,45,79,48],[79,19,81,22],[79,23,81,27],[79,28,81,31],[79,32,81,36],[80,11,81,17],[82,0,84,9],[82,11,85,17],[82,19,84,22],[82,23,84,27],[82,28,84,31],[82,32,84,36],[84,37,84,48],[85,23,85,27]]}
[]
[]
[]
[{"$nulls":11},"分会大会議事",{"$nulls":9},{"$f":"データリスト!F68&\"年度 活動経過報告\"","v":"2021年度 活動経過報告"},{"$nulls":16},{"$f":"データリスト!F68&\"年度 会計報告\"","v":"2021年度 会計報告"},{"$nulls":11},{"$f":"データリスト!F68&\"年度会計監査報告\"","v":"2021年度会計監査報告"}]
[null,{"$f":"\"第\"&データリスト!I6&\"回\"&\"　\"&データリスト!F4&\"分会\"&\"　\"&データリスト!F21&\"大会\"","v":"第59回　福島分会　定期大会"}]
[{"$nulls":11},"１．","司会者挨拶"]
[{"$nulls":20},{"$f":"\"　私達は、\"&データリスト!F68&\"年度活動方針を踏まえ労働組合の目的である　　　　　　　　　　　　「福利厚生を含めた総合的労働条件の向上を図り組合員とその家族の幸せを確実に拡大していくこと」を深く認識し、心・力を合わせ活動してきました。\"","v":"　私達は、2021年度活動方針を踏まえ労働組合の目的である　　　　　　　　　　　　「福利厚生を含めた総合的労働条件の向上を図り組合員とその家族の幸せを確実に拡大していくこと」を深く認識し、心・力を合わせ活動してきました。"},{"$nulls":21},{"$f":"データリスト!J68","v":44409}]
[{"$nulls":11},"２．","資格審査",{"$nulls":25},"自",{"$nulls":3},{"$f":"TEXT(AQ7,\"ggge年\")&\"8月1日\"","v":"令和3年8月1日"}]
{"$rows_left_out":79}
{"sheet":"議長議事進行メモ","index":7,"n_rows":190,"n_cols":19,"rows_kept":190,"merged":[[0,1,0,21],[1,5,1,20],[2,5,2,20],[5,5,5,20],[7,5,7,20],[8,5,8,20],[9,5,9,20],[10,5,11,20],[12,5,12,20],[13,5,13,20],[14,5,14,20],[15,5,15,20],[16,5,16,20],[17,5,17,20],[18,5,18,20],[19,5,19,20],[20,5,20,20],[21,5,21,20],[22,5,22,20],[23,5,23,20],[24,5,24,20],[25,5,25,20],[26,5,26,20],[27,5,27,20],[28,5,28,20],[29,5,29,20],[30,5,30,20],[31,5,31,20],[32,5,32,20],[33,5,33,20],[34,5,34,20],[35,5,35,20],[36,1,36,21],[37,5,37,10],[37,12,37,20],[38,5,38,7],[38,8,38,10],[38,12,44,20],[39,1,39,2],[39,5,71,7],[39,8,71,10],[45,12,45,15],[45,16,45,20],[46,12,51,15],[46,16,51,20],[52,12,52,20],[53,12,53,14],[53,15,53,17],[53,18,53,20],[54,12,64,14],[54,15,64,17],[54,18,64,20],[65,12,65,20],[66,12,66,15],[66,16,66,20],[67,12,71,15],[67,16,71,20],[72,1,72,21],[84,5,84,11],[84,13,84,20],[89,13,89,16],[89,17,89,20],[90,17,90,20],[111,1,111,21],[125,5,125,11],[125,13,125,20],[130,13,130,16],[130,17,130,20],[151,1,151,21]]}
[null,{"$f":"\"第\"&データリスト!I6&\"回\"&データリスト!F4&\"分会　\"&データリスト!F21&\"大会議事進行メモ①\"","v":"第59回福島分会　定期大会議事進行メモ①"}]
[null,"１．司会者挨拶",null,{"$f":"データリスト!F24","v":"花見"},null,"御集りの皆様、御苦労様です。"]
[{"$nulls":5},"本日は、お忙しい中お集りいただき、大変ありがとうございます。"]
[{"$nulls":5},{"$f":"\"本日の司会進行をさせていただきます、\"&データリスト!F24&\"でございます。\"","v":"本日の司会進行をさせていただきます、花見でございます。"}]
[{"$nulls":5},"どうぞよろしくお願いします。"]
[{"$nulls":5},{"$f":"\"さっそくではありますが、只今より第\"&データリスト!I6&\"回\"&データリスト!F4&\"分会\"&データリスト!F21&\"大会を開催いたします。\"","v":"さっそくではありますが、只今より第59回福島分会定期大会を開催いたします。"}]
[]
[null,"２．資格審査",null,{"$f":"データリスト!F24","v":"花見"},null,"これより資格審査を行います、資格審査員の方よろしくお願いします。"]
{"$rows_left_out":173}